{"text_format":"1","workbook":"xlsx","n_sheets":4,"sheets":["Mode d'emploi","Val. nut. fourrage 2017","Einführung","Futterw. Raufutter 2017"],"not_rendered":{"charts":1,"images":14,"macros":1,"external_links":1,"defined_names":7,"comments":0,"pivot_tables":0},"unopened":[],"bounds":{"document_bytes":16777216,"sheet_cells":100000,"rows_first":2000,"rows_last":500,"rows_between":2000,"halvings":0,"cell_chars":16384,"cell_head_chars":4096},"cells_cut":0,"cells_raw":0,"read":"whole","date_system":"1900"}

{"sheet":"Mode d'emploi","index":0,"n_rows":154,"n_cols":17,"rows_kept":154,"cut":false,"hidden":false,"merged":[]}
["Module de calcul LIVRE VERT 2017",null,null,null,null,"Y.Arrigo Agroscope ALP CH-1725 Posieux,      E-mail:   yves.arrigo@agroscope.admin.ch",null,null,null,null,null,null,null,null,null,"Légumineuses"]
[null,null,null,null,null,null,null,null,null,null,null,null,null,null,null,"Autres plantes feuilles"]
["Mode d'emploi, remarques et avertissements",null,null,null,null,null,null,null,null,null,null,null,null,null,null,"Autres plantes tiges"]
["Le module de calcul se réfère aux chapîtres 13 et 15 du Livre vert édition 2017 accessibles par inscription gratuite, www.agroscope",null,null,null,null,null,null,null,null,null,null,null,null,null,null,"Type inconnu","équations dMO par CB LV06"]
[null,null,null,null,null,null,null,null,null,null,null,null,null,null,null,"Dactyle","équations dMO par ADF LV06"]
["Les dépassements des champs d'application sont signalés ",null,null,null,null,null,null,null,null,null,null,null,null,null,null,"Ray-grass anglais"]
["Si les valeurs NEL, NEV, PAIE,PAIN n'apparaissent pas, c'est que les données sont incomplètes ou qu'il n'existe pas de régressions d'estimation pour dMO pour ce type de fourrage !",null,null,null,null,null,null,null,null,null,null,null,null,null,null,"Vulpin"]
[null,null,null,null,null,null,null,null,null,null,null,null,null,null,null,"Trèfle blanc","floraison"]
[null,null,null,null,null,null,null,null,null,null,null,null,null,null,null,"Trèfle violet","laiteux"]
["Le bouton ",null,"vide les cellules de données, remet les fonctions par défaut et annule toutes les options, il n'affecte pas le dernier choix des menus déroulants.",null,null,null,null,null,null,null,null,null,null,null,null,"Luzerne","pâteux-mou"]
[null,null,null,null,null,null,null,null,null,null,null,null,null,null,null,"Maïs","pâteux-dur"]
[]
[]
["Vous disposez de menus déroulants pour choisir les conserves, le type botanique "]
["et la clé pour l'estimation de la dMO (par CB ou par ADF), "]
["ces choix sont signalés dans l'édition imprimée des résultats."]
[]
[]
[]
[]
["Les données sont introduites dans les cellules réservées grises et bleues foncées.",null,null,null,null,null,null,null,"MS",100]
["Des données par défaut sont proposées dans les cellules bleues, elles peuvent être remplacées",null,null,null,null,null,null,null,"MA"]
["par des valeurs connues mais ceci requiert une initialisation pour retrouver la formule d’origine ",null,null,null,null,null,null,null,"CB"]
["pour un nouveau calcul.",null,null,null,null,null,null,null,"CE"]
["En principe on travail en g/kg MS et les résultats sont exprimés en unité/kg MS,",null,null,null,null,null,null,null,"ADF"]
["si les données sont dans la MF donnez la MS effective et les résultats seront en unité/kg",null,null,null,null,null,null,null,"NDF",null,null,null,"% MS ensilages et maïs (estimation amidon)"]
[null,null,null,null,null,null,null,null,null,null,null,"Pour les ensilages et le maïs donnez la MS dans la cellule à droite de la grille, "]
[null,null,null,null,null,null,null,null,null,null,null,"elle est nécessaire au calcul des produits de fermentation et à l'estimation de l'amidon"]
[]
[]
["Pour définir la deMA.du maïs vert choisir une maturité proposée"]
[]
["la valeur nutritive du maïs utilise la digestibilité de la matière organique obtenue par correction de la MOD calculée avec la dMO Livre vert 2006"]
["ou par la nouvelle équation nécessitant l'analyse von Soest (ADF, NDF), présentées aux journées ALP 2012, éditées dans Revue agronomique suisse et Agrarforschung septembre 2012"]
["si vous n'avez pas d'analyses ADF-NDF choisissez Maïs LV06 corrigé"]
["si vous avez les analyses ADF et NDF pour le maïs plante entière choisissez Maïs ALP12 pour PE "]
["si vous avez les analyses ADF et NDF pour le maïs pas plante entière (enrichis, ou récolte partielle) choisissez Maïs ALP12 pas PE "]
[]
[]
[]
["Les résultats sont édités en rouge, pour la dMO la valeur à gauche donne à titre indicatif",null,null,null,null,null,null,71.819753086419752,"dMO",76.819753086419752,"%"]
["la dMO par régression sans corrections"]
[]
["Des remarques peuvent apparaître pour signaler des informations manquantes, "]
["signaler que les champs d'application sont dépassés, dès lors les résultats perdent leur validité"]
[]
[]
[]
[]
[]
[]
[]
[]
[]
[]
[]
[]
["Les corrections de la dMO en fonction du cycle et du stade si ceux-ci sont connus "]
["doivent être appliquées "]
["si le stade n'est pas connu un stade est estimé en fonction du type de fourrage et de la conserve"]
["voir ci-dessous"]
[]
["Les options de corrections pour les valeurs des tables d'ensilages, de séchage des foins/regains "]
["sont proposées, il ne faut pas les utiliser pour les valeurs analysées, puisque les "]
["dépréciations sont déjà comprises dans l'analyse !"]
[]
["Dès qu'une options est activée elle est signalée dans les remarques"]
["et dans l'édition imprimée des résultats"]
[]
[]
[]
[]
[]
[]
[null,"corrections de la dMO pour les mélanges fourragers non déterminés, autres fourrages voir chap. 15 LV "]
[]
[null,"si le stade n'est pas donné le programme estime",null,null,null,"herbe","moyenne des stades 2 et 3"]
[null,"un stade en fonction du type de conserve, soit:",null,null,null,"ensilage ","moyenne des stades 2 et 3"]
[null,null,null,null,null,"sec","moyenne des stades 3 et 4"]
[null,null,null,null,null,"déshumidification","moyenne des stades 2 et 3"]
[]
["Les résultats sont imprimés sur une feuille neutre (sans arrière-plan) pour vous économiser de l'encre !"]
["Les valeurs ADF, NDF et sucres indiquées dans les résultats sont des valeurs indicatives issues d'estimations sommaires"]
["basées sur les valeurs données dans les tables. Elles ne peuvent pas prédire des valeurs sûres des constituants pariétaux à partir de la CB."]
[]
[]
[]
[]
[]
[]
[]
[]
[]
[]
[]
[]
[]
[]
[]
[]
[]
[]
[]
[]
[]
[]
[null,null,null,null,null,null,null,null,null,null,null,null,null,null,null,0]
[null,null,null,null,null,null,null,null,null,null,null,null,null,null,null,1]
[]
[]
[]
[]
[]
[]
[]
[]
[]
[]
[]
[]
[]
[]
[]
[]
[null,null,null,null,null,null,1]
[]
[]
[]
[]
[]
[]
[]
[]
[]
[]
[]
[]
[]
[]
[]
[]
[]
[]
[]
[]
[]
[]
[]
[]
[]
[]
[]
[]
[null,null,null,null,null,null,1]

{"sheet":"Val. nut. fourrage 2017","index":1,"n_rows":298,"n_cols":57,"rows_kept":298,"cut":false,"hidden":false,"merged":[[40,4,56,4],[0,20,35,20],[1,0,5,0],[1,4,13,4],[1,25,13,25],[7,0,13,0],[17,0,21,0],[17,25,36,25],[22,4,36,4],[23,0,31,0]]}
["  ","LIVRE VERT 2006",null,null,null,null,"référence",null,null,null,null,null,null,null,null,null,null,null,null,null,"cellules utilisée par la macro pour initialiser la feuille de calcul",null,"référence",null,null,null,"Fourrage:",{"$f":"INDEX(A61:A64,B60)","v":"en vert"},{"$f":"G1","v":"référence"},{"$f":"INDEX(A67:A82,B66)","v":"Graminées"}]
["FOURRAGES","version 6.6.2017 nouv.corr.2017 dMO bota ind.+stade manque",null,null,"DONNEES","MS",100,"%",{"$f":"IF($B$88=TRUE,A89,\"\")","v":"teneur en matière sèche, 100 si les teneurs sont données dans la MS"},null,null,null,null,null,null,null,null,null,null,null,null,null,100,null,null,"DONNEES",{"$f":"F2","v":"MS"},{"$f":"G2","v":100},{"$f":"H2","v":"%"},{"$f":"I2","v":"teneur en matière sèche, 100 si les teneurs sont données dans la MS"}]
[null,null,null,null,null,"MA",null,288.48062856909746,97.712067340801283,null,null,null,null,null,null,null,null,null,"  ",null,null,null,null,null,null,null,{"$f":"F3","v":"MA"},{"$f":"IF(G3=\"\",\"\",G3)","v":""},{"$f":"H3","v":288.48062856909746},97.712067340801283]
[null,null,null,null,null,"CB",null,{"$f":"IF($G$2=100,\"g/kg MS\",\"g/kg\")","v":"g/kg MS"},"cellulose brute",null,null,null,null,null,null,null,null,null,null,null,null,null,null,null,null,null,"CB","","g/kg MS","cellulose brute"]
[null,null,null,null,null,"CE",null,{"$f":"IF($G$2=100,\"g/kg MS\",\"g/kg\")","v":"g/kg MS"},"cendres",null,null,null,null,null,null,null,null,null,null,null,null,null,null,null,null,null,"CE","","g/kg MS","cendres"]
[null,null,null,"  ",null,"ADF",null,{"$f":"IF($G$2=100,\"g/kg MS *\",\"g/kg *\")","v":"g/kg MS *"},"lignocellulose (ADF)",null,null,null,null,null,null,null,null,null,null,null,null,null,null,null,null,null,"ADF",{"$f":"IF(G6=\"\",\"\",G6)","v":""},"g/kg MS *","lignocellulose (ADF)"]
[null,null,null,null,null,"NDF",null,{"$f":"IF($G$2=100,\"g/kg MS *\",\"g/kg *\")","v":"g/kg MS *"},"parois (NDF)",null,null,null,null,null,null,null,null,null,null,null,null,null,null,null,null,null,"NDF","","g/kg MS *","parois (NDF)"]
["TYPE  BOTANIQUE",null,null,null,null,"MG",{"$f":"IF(G2=\"\",\"\",IF(G3=\"\",\"\",0.35*G2))","v":""},{"$f":"IF($G$2=100,\"g/kg MS *\",\"g/kg *\")","v":"g/kg MS *"},"matière grasse",null,null,null,null,null,null,null,null,null,null,null,null,null,{"$f":"IF(W2=\"\",\"\",IF(W3=\"\",\"\",0.35*W2))","v":""},null,null,null,"MG","","g/kg MS *","matière grasse"]
[null,null,null,null,null,"PF",{"$f":"IF(G2=\"\",\"\",IF(G3=\"\",\"\",IF(B60<>2,0,A255*F255)))","v":""},{"$f":"IF($G$2=100,\"g/kg MS *\",\"g/kg *\")","v":"g/kg MS *"},"produits fermentaires (ensilage) donner % MS >  >  >",null,null,null,null,"% MS ensilages et maïs (estimation amidon)",null,null,null,null,null,null,null,null,{"$f":"IF(W2=\"\",\"\",IF(W3=\"\",\"\",IF(R60<>2,0,Q255*V255)))","v":""},null,null,null,"PF","","g/kg MS *",{"$f":"CONCATENATE(\"produit fermentaire de l'ensilage \",IF(M9=\"\",\"\",M9),\" % MS \")","v":"produit fermentaire de l'ensilage  % MS "}]
[null,null,null,null,null,"deMA",{"$f":"IF(G2=\"\",\"\",IF(G3=\"\",\"\",IF(G5=\"\",\"\",A247)))","v":""},"% *","degradabilité de la matière azotée",null,null,null,null,null,null,null,null,null,null,null,null,null,{"$f":"IF(W2=\"\",\"\",IF(W3=\"\",\"\",IF(W5=\"\",\"\",Q247)))","v":""},null,null,null,"deMA","","% *","degradabilité de la matière azotée"]
[null,null,null,null,null,"dAAA",{"$f":"IF(G2=\"\",\"\",IF(G3=\"\",\"\",IF(G5=\"\",\"\",A259)))","v":""},"% *","digestibilité des acides aminés d'origine alimentaire ",null,null,null,null,null,null,null,null,null,null,null,null,null,{"$f":"IF(W2=\"\",\"\",IF(W3=\"\",\"\",IF(W5=\"\",\"\",Q259)))","v":""},null,null,null,"dAAA","","% *","digestibilité des acides aminés d'origine alimentaire "]
[]
[null,null,null,null,null,"dMO",{"$f":"IF(G2=\"\",\"\",IF(G5=\"\",\"\",IF(AA145=0,\"\",AA145)))","v":""},"%",{"$f":"IF($B$88=TRUE,A99,\"\")","v":"digestibilité de la matière organique (valeur connue in vivo ou tables LV, désactiver correction cycle ET stade!)"},null,null,null,null,null,null,null,null,null,null,null,null,null,{"$f":"IF(W2=\"\",\"\",IF(W5=\"\",\"\",IF(AQ145=0,\"\",AQ145)))","v":""},null,null,null,"dMO",{"$f":"IF(G13=\"\",\"\",G13)","v":""},"%","digestibilité de la matière organique (valeur connue in vivo ou tables LV, désactiver correction cycle ET stade!)"]
[null,null,null,null,null,"dMA",null,"%",{"$f":"IF($B$88=TRUE,A100,\"\")","v":"digestibilité de la matière azotée (valeur in vivo ou tables LV)"},null,null,null,null,null,null,null,null,null,null,null,null,null,null,null,null,null,"dMA",{"$f":"IF(G14=\"\",\"\",G14)","v":""},"%","digestibilité de la matière azotée (valeur in vivo ou tables LV)"]
[]
[null,{"$f":"INDEX(C67:C82,B66)","v":">70% de graminées"},null,null,null,"amidon",{"$f":"IF(B66=16,IF(G2=\"\",\"\",IF(G3=\"\",\"\",IF(M9<20,0,IF(M9<=30,22.571*M9-382.62,315)))),\"\")","v":""},{"$f":"IF($G$2=100,\"g/kg MS *\",\"g/kg *\")","v":"g/kg MS *"},{"$f":"IF($B$88=TRUE,A120,\"\")","v":"* par défaut, d'autres valeurs peuvent être données, mais implique initialisation pour nouveau calcul"},null,null,null,null,null,null,null,null,null,null,null,null,null,{"$f":"IF(R66=16,IF(W2=\"\",\"\",IF(W3=\"\",\"\",IF(AC9<20,0,IF(AC9<=30,22.571*AC9-382.62,315)))),\"\")","v":""},{"$f":"INDEX(X18:X21,B60)","v":"en vert"},{"$f":"C66","v":"G"},null,{"$f":"IF(AB13=\"\",\"\",IF(P121=1,\"dMO pas corrigée !\",IF(P122=1,CONCATENATE(\"dMO corrigée selon cycle \",P121-1,\" et conserve car le stade manque\"),CONCATENATE(\"dMO corrigée selon cycle \",P121-1,\" et stade \",P122))))","v":""},null,null,{"$f":"IF(AND(B60=3,B66=16),\"pas d'équation pour ce type de fourrage\",CONCATENATE(K60,\" pour fourrage \",X16,\" ; type \",Y16))","v":"équations dMO par CB LV06 pour fourrage en vert ; type G"}]
[null,null,null,null,null," ",null,null,null,null,null,null,null,null,null,null,null,null,null,null,null,null,null,null,null,null,"résultats"]
["OPTIONS LV",null,null,null,{"$f":"IF(G18=\"\",\"\",IF(AA145=0,\"\",AA145))","v":""},"dMO",{"$f":"IF(G85=1,\"\",IF(G2=\"\",\"\",IF(G3=\"\",\"\",IF(AD145=0,\"\",IF(AD145=\"\",\"\",AD145)))))","v":""},"%",{"$f":"IF($B$88=TRUE,A101,\"\")","v":"digestibilité de la MO ( donnée) , utilisée dans le calcul"},null,null,null,null,null,null,null,null,null,null,null,null,null,{"$f":"IF(W85=1,\"\",IF(W2=\"\",\"\",IF(W3=\"\",\"\",IF(AT145=0,\"\",IF(AT145=\"\",\"\",AT145)))))","v":""},"en vert",null,"RESULTATS CALCULES","dMO",{"$f":"IF(G18=\"\",\"\",G18)","v":""},"%","digestibilité de la MO ( donnée) , utilisée dans le calcul"]
[null,null,null,null,"    RESULTATS","dMA",{"$f":"IF(G18=\"\",\"\",IF(G227=TRUE,\"\",IF(G2=\"\",\"\",F227)))","v":""},"%","digestibilité de la MA (par régression ) , utilisée dans le calcul",null,null,null,null,null,null,null,null,null,null,null,null,null,{"$f":"IF(W18=\"\",\"\",IF(W227=TRUE,\"\",IF(W2=\"\",\"\",V227)))","v":""},"ensilage",null,null,"dMA",{"$f":"IF(G19=\"\",\"\",G19)","v":""},"%","digestibilité de la MA (par régression ) , utilisée dans le calcul"]
[null,null,null,null,null,"NEL",{"$f":"IF(G18=\"\",\"\",IF(G239=TRUE,\"\",IF(G2=\"\",\"\",C239+C239*J140)))","v":""},{"$f":"IF($G$2=100,\"MJ/kg MS\",\"MJ/kg\")","v":"MJ/kg MS"},"énergie nette lait",null,null,null,null,null,null,null,null,null,null,null,null,null,{"$f":"IF(W18=\"\",\"\",IF(W239=TRUE,\"\",IF(W2=\"\",\"\",S239+S239*Z140)))","v":""},"sec",null,null,"NEL",{"$f":"IF(G20=\"\",\"\",G20)","v":""},"MJ/kg MS","énergie nette lait"]
[null,null,null,null,null,"NEV",{"$f":"IF(G18=\"\",\"\",IF(G240=TRUE,\"\",IF(G2=\"\",\"\",C240+C240*K140)))","v":""},{"$f":"IF($G$2=100,\"MJ/kg MS\",\"MJ/kg\")","v":"MJ/kg MS"},"énergie nette viande",null,null,null,null,null,null,null,null,null,null,null,null,null,{"$f":"IF(W18=\"\",\"\",IF(W240=TRUE,\"\",IF(W2=\"\",\"\",S240+S240*AA140)))","v":""},"déshydraté artificiel.",null,null,"NEV","","MJ/kg MS","énergie nette viande"]
[null,{"$f":"IF(G3=\"\",\"\",IF(B66=16,\"donner maturité maïs et MS\",\"\"))","v":""},null,null,null,"PAIE",{"$f":"IF(G18=\"\",\"\",IF(G267=TRUE,\"\",IF(G2=\"\",\"\",C267+C267*L140)))","v":""},{"$f":"IF($G$2=100,\"g/kg MS\",\"g/kg\")","v":"g/kg MS"},"protéines absorbables dans l'intestin synthétisées à partir de l'énergie disponible (deMA/dAAA  LV06)",null,null,null,null,null,null,null,null,null,null,null,null,null,{"$f":"IF(W18=\"\",\"\",IF(W267=TRUE,\"\",IF(W2=\"\",\"\",S267+S267*AB140)))","v":""},null,null,null,"PAIE","","g/kg MS","protéines absorbables dans l'intestin synthétisées à partir de l'énergie disponible (deMA/dAAA  LV06)"]
[null,{"$f":"H65","v":""},{"$f":"IF(B66=16,IF(G84=1,\"manque CB, ADF ou NDF\",\"\"),\"\")","v":""},null,"RESULTATS","PAIN",{"$f":"IF(G18=\"\",\"\",IF(G268=TRUE,\"\",IF(G2=\"\",\"\",IF(C268=0,\"\",C268+C268*M140))))","v":""},{"$f":"IF($G$2=100,\"g/kg MS\",\"g/kg\")","v":"g/kg MS"},"protéines absorbables dans l'intestin synthétisées à partir de la matière azotée dégradée (deMA/dAAA  LV06)",null,null,null,null,null,null,null,null,null,null,null,null,null,{"$f":"IF(W18=\"\",\"\",IF(W268=TRUE,\"\",IF(W2=\"\",\"\",IF(S268=0,\"\",S268+S268*AC140))))","v":""},null,null,null,"PAIN","","g/kg MS","protéines absorbables dans l'intestin synthétisées à partir de la matière azotée dégradée (deMA/dAAA  LV06)"]
["REMARQUES",{"$f":"IF(G2=\"\",\"\",IF(B60=2,IF(M9=\"\",\"DONNER LA MS DE L'ENSILAGE !\",\"\"),\"\"))","v":""},null,null,null,"PME",{"$f":"IF(G18=\"\",\"\",IF(G2=\"\",\"\",IF(G271=TRUE,\"\",C271)))","v":""},"g/kg MS",{"$f":"IF($B$88=TRUE,A108,\"\")","v":"quantité de protéines microbiennes synthétisées à partir de l'énergie fermentescible"},null,null,null,null,null,null,null,null,null,null,null,null,null,{"$f":"IF(W18=\"\",\"\",IF(W2=\"\",\"\",IF(W271=TRUE,\"\",S271)))","v":""},null,null,null,{"$f":"F26","v":"PAIMN"},{"$f":"IF(G26=\"\",\"\",G26)","v":""},{"$f":"H26","v":"g/kg MS"},{"$f":"I26","v":"protéines absorbables dans l'intestin synthétisées à partir de la matière azotée dégradable"}]
[null,{"$f":"IF(G2=\"\",\"\",IF(B60=1,IF(B66=16,\"CHOISIR LA MATURITE DU MAIS VERT\",\"\"),\"\"))","v":""},null,null,null,"PMN",{"$f":"IF(G18=\"\",\"\",IF(G270=TRUE,\"\",IF(G2=\"\",\"\",IF(C270=0,\"\",C270))))","v":""},"g/kg MS",{"$f":"IF($B$88=TRUE,A109,\"\")","v":"quantité de protéines microbiennes synthétisées à partir de la matière azotée dégradable"},null,null,null,null,null,null,null,null,null,null,null,null,null,{"$f":"IF(W18=\"\",\"\",IF(W270=TRUE,\"\",IF(W2=\"\",\"\",IF(S270=0,\"\",S270))))","v":""},null,null,null,{"$f":"F24","v":"PME"},{"$f":"IF(G24=\"\",\"\",G24)","v":""},{"$f":"H24","v":"g/kg MS"},{"$f":"I24","v":"quantité de protéines microbiennes synthétisées à partir de l'énergie fermentescible"}]
[null,{"$f":"IFERROR(IF(G2=\"\",\"\",IF(G3=\"\",\"\",IF(G37>30,\"EXCES EN AZOTE !\",\"\"))),\"\")","v":""},null,null,null,"PAIMN",{"$f":"IF(G18=\"\",\"\",IF(G2=\"\",\"\",IF(G269=TRUE,\"\",IF(C269=0,\"\",C269))))","v":""},"g/kg MS",{"$f":"IF($B$88=TRUE,A107,\"\")","v":"protéines absorbables dans l'intestin synthétisées à partir de la matière azotée dégradable"},null,null,null,null,null,null,null,null,null,null,null,null,null,{"$f":"IF(W18=\"\",\"\",IF(W2=\"\",\"\",IF(W269=TRUE,\"\",IF(S269=0,\"\",S269))))","v":""},null,null,null,{"$f":"F25","v":"PMN"},{"$f":"IF(G25=\"\",\"\",G25)","v":""},{"$f":"H25","v":"g/kg MS"},{"$f":"I25","v":"quantité de protéines microbiennes synthétisées à partir de la matière azotée dégradable"}]
[null,{"$f":"IF(G2=\"\",\"\",IF(G3=\"\",\"\",O109))","v":""},null,null,null,"PAIA",{"$f":"IF(G18=\"\",\"\",IF(G2=\"\",\"\",IF(G272=TRUE,\"\",IF(C272=0,\"\",C272))))","v":""},"g/kg MS",{"$f":"IF($B$88=TRUE,A110,\"\")","v":"protéines alimentaires absorbables dans l'intestin"},null,null,null,null,null,null,null,null,null,null,null,null,null,{"$f":"IF(W18=\"\",\"\",IF(W2=\"\",\"\",IF(W272=TRUE,\"\",IF(S272=0,\"\",S272))))","v":""},null,null,null,"PAIA","","g/kg MS","protéines alimentaires absorbables dans l'intestin"]
[null,{"$f":"IF(G2=\"\",\"\",IF(G4=\"\",\"\",O110))","v":""},"  ",null,null,"PAIM",{"$f":"IF(G18=\"\",\"\",IF(G266=TRUE,\"\",IF(G2=\"\",\"\",0.093*(C266*G2/100))))","v":""},"g/kg MS","protéines absorbables dans l'intestin d'origine microbienne (MOF*0.093)",null,null,null,null,null,null,null,null,null,null,null,null,null,{"$f":"IF(W18=\"\",\"\",IF(W266=TRUE,\"\",IF(W2=\"\",\"\",0.093*(S266*W2/100))))","v":""},null,null,null,"PAIM","","g/kg MS","protéines absorbables dans l'intestin d'origine microbienne (MOF*0.093)"]
[null,{"$f":"IF(G2=\"\",\"\",IF(G6=\"\",\"\",O112))","v":""},null,null,null,"EM",{"$f":"IF(G18=\"\",\"\",IF(G220=TRUE,\"\",IF(G2=\"\",\"\",B220)))","v":""},{"$f":"IF($G$2=100,\"MJ/kg MS\",\"g/kg\")","v":"MJ/kg MS"},"énergie métabolisable",null,null,null,null,null,null,null,null,null,null,null,null,null,{"$f":"IF(W18=\"\",\"\",IF(W220=TRUE,\"\",IF(W2=\"\",\"\",R220)))","v":""},null,null,null,"EM","","MJ/kg MS","énergie métabolisable"]
[null,{"$f":"IFERROR(IF(G18=\"\",\"\",IF(AD145=\"\",\"\",IF(AD145=0,\"\",O114))),\"\")","v":""},null,null,null,"ADF",{"$f":"IF(G2=\"\",\"\",IF(G6=\"\",IF(AF145=0,\"\",AF145),G6))","v":""},"g/kg MS","valeur indicative lignocellulose (ADF) par régression base CB et type botanique",null,null,null,null,null,null,null,null,null,null,null,null,null,{"$f":"IF(W2=\"\",\"\",IF(W6=\"\",IF(AV145=0,\"\",AV145),W6))","v":""},null,null,null,"ADF","","g/kg MS","valeur indicative lignocellulose (ADF) par régression base CB et type botanique"]
[null,{"$f":"S63","v":""},null,null,null,"NDF",{"$f":"IF(G2=\"\",\"\",IF(G7=\"\",IF(AH145=0,\"\",AH145),G7))","v":""},"g/kg MS","valeur indicative parois (NDF) par régression base CB et type botanique",null,null,null,null,null,null,null,null,null,null,null,null,null,{"$f":"IF(W2=\"\",\"\",IF(W7=\"\",IF(AX145=0,\"\",AX145),W7))","v":""},null,null,null,"NDF","","g/kg MS","valeur indicative parois (NDF) par régression base CB et type botanique"]
[null,{"$f":"S62","v":""},null,null,null,"SUCRES",{"$f":"IF(G2=\"\",\"\",IF(G4=\"\",\"\",IF(AJ145=0,\"\",AJ145)))","v":""},"g/kg MS","valeur indicative sucres par régression base CB et type botanique",null,null,null,null,null,null,null,null,null,null,null,null,null,{"$f":"IF(W2=\"\",\"\",IF(W4=\"\",\"\",IF(AZ145=0,\"\",AZ145)))","v":""},null,null,null,"SUCRES","","g/kg MS","valeur indicative sucres par régression base CB et type botanique"]
[]
[null,null,null,null,null,"PPL NEL",{"$f":"IF(G2=\"\",\"\",IF(G20=\"\",\"\",G20/3.14))","v":""},"kg lait",{"$f":"IF($B$88=TRUE,A116,\"\")","v":"potentiel production lait selon NEL par kg MS (NEL/3.14)"},null,null,null,null,null,null,null,null,null,null,null,null,null,{"$f":"IF(W2=\"\",\"\",IF(W20=\"\",\"\",W20/3.14))","v":""},null,null,null,"PPL NEL","","kg lait","potentiel production lait selon NEL par kg MS (NEL/3.14)"]
[null,null,null,null,null,"PPL PAIE",{"$f":"IF(G2=\"\",\"\",IF(G22=\"\",\"\",G22/50))","v":""},"kg lait",{"$f":"IF($B$88=TRUE,A117,\"\")","v":"potentiel production lait selon PAIE par kg MS (PAIE/50)"},null,null,null,null,null,null,null,null,null,null,null,null,null,{"$f":"IF(W2=\"\",\"\",IF(W22=\"\",\"\",W22/50))","v":""},null,null,null,"PPL PAIE",{"$f":"G35","v":""},"kg lait","potentiel production lait selon PAIE par kg MS (PAIE/50)"]
[null,null,null,null,null,"PPL PAIN",{"$f":"IF(G2=\"\",\"\",IF(G23=\"\",\"\",G23/50))","v":""},"kg lait",{"$f":"IF($B$88=TRUE,A118,\"\")","v":"potentiel production lait selon PAIN par kg MS (PAIN/50)"},null,null,null,null,null,null,null,null,null,null,null,null,null,{"$f":"IF(W2=\"\",\"\",IF(W23=\"\",\"\",W23/50))","v":""},null,null,null,"PPL PAIN",{"$f":"G36","v":""},"kg lait","potentiel production lait selon PAIN par kg MS (PAIN/50)"]
[null,"yves.arrigo@agroscope.admin.ch",null,null,null,"MA/NEL ",{"$f":"IF(G2=\"\",\"\",IF(G3=\"\",\"\",IF(G20=\"\",\"\",G3/G20)))","v":""},"g/MJ",{"$f":"IF($B$88=TRUE,A119,\"\")","v":"équilibre protéines/énergie (20g lactation, 18g taries & repos, 19g engrais)"},null,null,null,null,null,null,null,null,null,null,null,null,null,{"$f":"IF(W2=\"\",\"\",IF(W3=\"\",\"\",IF(W20=\"\",\"\",W3/W20)))","v":""},null,null,null,{"$f":"F37","v":"MA/NEL "},{"$f":"G37","v":""},{"$f":"H37","v":"g/MJ"},"équilibre protéines/énergie (20g lactation, 18g taries & repos, 19g engrais)"]
[]
[]
[]
[null,null,null,null,"CORRECTIONS"]
[null,null,null,null,null,null,"correction de la dMO selon cycle  et  stade",null,null,null,{"$f":"IF(F66=16,\"pas de corrections dMO\",INDEX(A67:A82,B66))","v":"Graminées"},null,{"$f":"IF(OR(G3=\"\",G5=\"\"),\"\",CONCATENATE(\"correction dMO :  \",IF(Y120=0,0,ROUND(Y120-AC145,1))))","v":""}]
[null,null,null,null,null,null,null,null,null,null,null,null,null,null,null,{"$f":"IF($P$121=1,\"\",IF($P$122<>1,\"\",\"si le stade n'est pas donné la dMO est corrigée en fonction du cycle et du type de fourrage\"))","v":""}]
[null,null,null,null,null,{"$f":"IF(P122>1,IF(P121=1,\"donnez le cycle\",\"\"),\"\")","v":""},"cycle",null,null,null,null,null,null,null,null,{"$f":"IF($P$121=1,\"\",IF($P$122<>1,\"\",\"herbe = moyenne corrections stades 2 et 3\"))","v":""},null,null,null,null,null,null,null,null,null,null,null,null,null," version 2017.06.06 avec nouvelles corrections dMO pour cycles et stades, auteur aryv"]
[null,null,null,null,null,null,null,null,null,null,null,null,null,null,null,{"$f":"IF($P$121=1,\"\",IF($P$122<>1,\"\",\"ensilage=  moyenne corrections stades 2 et 3\"))","v":""}]
[null,null,null,null,null,{"$f":"IF(B66=16,\"\",IF(P121>1,IF(P122=1,\"donnez un stade\",\"\"),\"\"))","v":""},"stade",null,null,null,null,null,null,null,null,{"$f":"IF($P$121=1,\"\",IF($P$122<>1,\"\",\"sec = moyenne corrections stades 3 et 4\"))","v":""}]
[null,null,null,null,null,{"$f":"IF(P121=1,\"\",IF(B66<>8,\"\",IF(P122<>1,\"\",\"sinon selon cycle +type de fourrage\")))","v":""},null,null,null,null,null,null,null,null,null,{"$f":"IF($P$121=1,\"\",IF($P$122<>1,\"\",\"déshydraté=  moyenne corrections stades 2 et 3\"))","v":""}]
[]
[]
[null,null,null,null,null,null,null,"corrections conservation pour ensilage",null,null,null,"corrections conservation pour foins/regains",null,null,null,"les corrections dues à la conservation"]
[null,null,null,null,null,null,null,null,null,null,null,null,null,null,null,"sont réservées aux valeurs issues des tables !"]
[null,null,null,null,null,null,"qualité fermentaire ",null,null,null,"séchage",null,null,null,null,"Les valeurs analysées tiennentt déjà compte"]
[null,null,null,null,null,null,null,null,null,null,null,null,null,null,null,"des dépréciations dues à la conservation !"]
[null,null,null,null,null,null,"postfermentations",null,null,null,"cond. météo"]
[]
[null,null,null,null,null,null,"corr. autom. MS 20-50",null,null,null,"fermentation"]
[]
[]
[null,null,null,null,null,"  "]
["TYPE",1,{"$f":"INDEX(B61:B64,B60)","v":"VER"},null,"EDITION",1,null,"CHOIX DMO","équations dMO par CB LV06",1,{"$f":"INDEX(I60:I62,J60)","v":"équations dMO par CB LV06"},null,"maturité Maïs v.",null,null,"corrections ens.",null,{"$f":"SUM(G124,G127,G130)","v":3},{"$f":"IF(R60>3,\"correction ensilage activée\",\"\")","v":""}]
["en vert","VER",null,null,"deMA/dAAA  LV06",null,null,null,"équations dMO par ADF LV06",null,null,null,null,null,null,"corrections sec",null,{"$f":"SUM(G134,G135,G137)","v":3},{"$f":"IF(R61>3,\"correction conserve foin activée\",\"\")","v":""}]
["ensilage","ENS",null,null,null,null,null,null,null,null,null,null,null,null,null,"corrections cycle-stade",null,{"$f":"SUM(P121:P122)","v":2},{"$f":"IF(R62>3,\"dMO corrigée selon cycle+stade\",\"\")","v":""}]
["sec","SEC",null,null,"différencie calcul deMA, dAAA, PF",null,null,null,null,null,null,null,null,null,null,"pour remarques",null,null,{"$f":"IF(B60=2,S60,IF(B60=3,S61,\"\"))","v":""}]
["déshydraté artificiellement","DZU",null,null,null,null,null,"formule choix de l'option si dMO 06….. Prendre deMA/dAAA LV06"]
[null,null,null,null,null,null,null,{"$f":"IF(J60<>3,IF(F60=1,\"\",\"PRENEZ OPTION deMA/dAAA LV06\"),IF(F60=1,\"PRENEZ OPTION deMA/dAAA LV99\",\"\"))","v":""}]
["BOTA",1,{"$f":"INDEX(B67:B82,B66)","v":"G"},null,null,null,"typlolgie"]
["Graminées","G",">70% de graminées",null,null,null,"10% Ray-gras anglais/ 50% Dactyle/ 20% Vulpin des prés/10% Trèfle blanc/10% Dent-de-lion"]
["G.Ray-grass","GR",">70% de graminées dont >50% de ray-grass",null,null,null,"50% Ray-gras anglais/ 10% Ray-grass d'Italie/ 20% Dactyle/ 10% Trèfle blanc/10% Dent-de-lion"]
["Equilibré","E","50-70% de graminées",null,null,null,"10% Ray-gras anglais/ 35% Dactyle/ 15% Vulpin des prés/ 15% Trèfle blanc/ 5% Trèfle violet/ 20% Dent-de-lion"]
["Equil.Ray-grass","ER","50-70% de graminées dont >50% de ray-grass",null,null,null,"35% Ray-gras anglais/ 10% Ray-grass d'Italie/ 15% Dactyle/ 15% Trèfle blanc/ 5% Trèfle violet/ 20% Dent-de-lion"]
["Légumineuses","L",">50% de légumineuses",null,null,null,"15% Ray-gras anglais/ 10% Dactyle/ 50% Trèfle blanc/ 15% Trèfle violet/ 10% Dent-de-lion"]
["Autres plantes feuilles","DF",">50% d'autres plantes fines riches en feuilles",null,null,null,"15% Ray-gras anglais/ 10% Dactyle/ 10% Trèfle blanc/ 65% Dent-de-lion"]
["Autres plantes tiges","DT",">50% d'autres plantes grossières riches en tiges",null,null,null,"15% Dactyle/ 10% Vulpin des prés/ 10% Trèfle blanc/ 5% Dent-de-lion/ 30% Anthrisque sauvage/ 30% Grande berce"]
["Type inconnu","INC","non déterminée",null,null,null,"indéterminée"]
["Dactyle","dg","en culture pure",null,null,null,"100% Dactyle"]
["Ray-grass anglais","lp","en culture pure",null,null,null,"100% Ray-grass anglais"]
["Ray-grass italien","li","en culture pure",null,null,null,"100% Ray-grass italien"]
["Vulpin","ap","en culture pure",null,null,null,"100% Vulpin"]
["Trèfle blanc","tr","en culture pure",null,null,null,"100% Trèfle blanc"]
["Trèfle violet","tp","en culture pure",null,null,null,"100% Trèfle violet"]
["Luzerne","LUZ","en culture pure",null,null,null,"100% Luzerne"]
["Maïs","MAÏS","en culture pure",null,null,null,"100% Maïs"]
["MAÏS option équations",null,"Maïs LV06 corrigé",null,"dMO retenue",{"$f":"AA144","v":false},"validation ALP12 besoin CB, ADF, NDF"]
[1,null,"Maïs ALP12 pour PE",null,null,null,{"$f":"IF(A84>1,IF(OR(G6=\"\",G7=\"\",G4=\"\"),1,2),\"\")","v":""},"2,3 ALP12"]
[{"$f":"IF(B66<>16,2,A84)","v":2},null,"Maïs ALP12 pas PE",null,null,null,{"$f":"IF(G84=1,IF(AND(A84>1),1,0))","v":false},"si 1 pas de résultats car manque ADF,NDF"]
[]
[]
["DEFINITONStion",true]
["teneur en matière sèche, 100 si les teneurs sont données dans la MS"]
["matière azotée (protéines)"]
["cellulose brute"]
["cendres"]
["lignocellulose (ADF)"]
["parois (NDF)"]
["matière grasse"]
["produits fermentaires (ensilage) donner % MS >  >  >"]
["degradabilité de la matière azotée"]
["digestibilité des acides aminés d'origine alimentaire "]
["digestibilité de la matière organique (valeur connue in vivo ou tables LV, désactiver correction cycle ET stade!)"]
["digestibilité de la matière azotée (valeur in vivo ou tables LV)"]
[{"$f":"IF(G101=TRUE,\"\",CONCATENATE(\"digestibilité de la MO (\",IF(AA145=AC145,K60,\" donnée\"),\") , utilisée dans le calcul\"))","v":"digestibilité de la MO ( donnée) , utilisée dans le calcul"},null,null,null,null,null,{"$f":"ISERROR(AA145)","v":false}]
[{"$f":"CONCATENATE(\"digestibilité de la MA (\",IF(G14=\"\",\"par régression\",\"donnée\"),\" ) , utilisée dans le calcul\")","v":"digestibilité de la MA (par régression ) , utilisée dans le calcul"}]
["énergie nette lait"]
["énergie nette viande"]
[{"$f":"CONCATENATE(\"protéines absorbables dans l'intestin synthétisées à partir de l'énergie disponible \",\"(\",INDEX(E61:E62,F60),\")\")","v":"protéines absorbables dans l'intestin synthétisées à partir de l'énergie disponible (deMA/dAAA  LV06)"},null,null,null,null,null,null,null,null,null,null,null,null,null,{"$f":"IF(B66<9,\"mélange\",\"culture pure\")","v":"mélange"}]
[{"$f":"CONCATENATE(\"protéines absorbables dans l'intestin synthétisées à partir de la matière azotée dégradée \",\"(\",INDEX(E61:E62,F60),\")\")","v":"protéines absorbables dans l'intestin synthétisées à partir de la matière azotée dégradée (deMA/dAAA  LV06)"}]
["protéines absorbables dans l'intestin synthétisées à partir de la matière azotée dégradable",null,null,null,null,null,null,null,"Données exprimée dans la MS",null,null,"Données exprimée dans la MO",null,null,"HORS CHAMP D'APPLICATION !",null,null,null,null,"champ mélange",null,"champ cult. pure"]
["quantité de protéines microbiennes synthétisées à partir de l'énergie fermentescible",null,null,null,null,null,null,null,"MS",{"$f":"G2*10","v":1000},"g "]
["quantité de protéines microbiennes synthétisées à partir de la matière azotée dégradable",null,null,null,null,null,null,null,"MA",{"$f":"G3/$J$108*1000","v":0},"g/kg MS","MAmo",{"$f":"J109/J115*1000","v":{"$error":"#DIV/0!"}},{"$f":"IF(M109=0,0,1)","v":{"$error":"#DIV/0!"}},{"$f":"IF($B$66<9,IF(J109<50,Q109,IF(J109>280,Q109,\"\")),IF(J109<50,Q109,IF(J109>320,Q109,\"\")))","v":"MA hors champ d'application"},null,"MA hors champ d'application",null,null,"50 - 280","MA","50 - 320"]
["protéines alimentaires absorbables dans l'intestin",null,null,null,null,null,null,null,"CB",{"$f":"G4/$J$108*1000","v":0},"g/kg MS","CBmo",{"$f":"J110/J115*1000","v":{"$error":"#DIV/0!"}},{"$f":"IF(M110=0,0,1)","v":{"$error":"#DIV/0!"}},{"$f":"IF($B$66<9,IF(J110<130,Q110,IF(J110>400,Q110,\"\")),IF(J110<130,Q110,IF(J110>410,Q110,\"\")))","v":"CB hors champ d'application"},null,"CB hors champ d'application",null,null,"130 - 400","CB","130 - 410"]
["protéines absorbables dans l'intestin d'origine microbienne (MOF*0.093)",null,null,null,null,null,null,null,"CE",{"$f":"IF(G5=\"\",1000,G5/$J$108*1000)","v":1000},"g/kg MS","NDFmo",{"$f":"J113/J115*1000","v":{"$error":"#DIV/0!"}}]
["énergie métabolisable",null,null,null,null,null,null,null,"ADF",{"$f":"G6/$J$108*1000","v":0},"g/kg MS","ENAmo",{"$f":"J117/J115*1000","v":{"$error":"#DIV/0!"}},null,{"$f":"IF($B$66<9,IF(J112<170,Q112,IF(J112>420,Q112,\"\")),IF(J112<150,Q112,IF(J112>450,Q112,\"\")))","v":"ADF hors champ d'application"},null,"ADF hors champ d'application",null,null,"170 - 420","ADF","150 - 450"]
[{"$f":"IF(G6=\"\",\"valeur indicative lignocellulose (ADF) par régression base CB et type botanique\",\"lignocellulose (ADF) donnée\")","v":"valeur indicative lignocellulose (ADF) par régression base CB et type botanique"},null,null,null,null,null,null,null,"NDF",{"$f":"G7/$J$108*1000","v":0},"g/kg MS","MAmo2",{"$f":"M109^2","v":{"$error":"#DIV/0!"}}]
[{"$f":"IF(G7=\"\",\"valeur indicative parois (NDF) par régression base CB et type botanique\",\"parois (NDF) donné\")","v":"valeur indicative parois (NDF) par régression base CB et type botanique"},null,null,null,null,null,null,null,"MG",{"$f":"IF(G8=\"\",0,G8/$J$108*1000)","v":0},"g/kg MS","CBmo2",{"$f":"M110^2","v":{"$error":"#DIV/0!"}},null,{"$f":"IF($B$66<9,IF(AD155<55,Q114,IF(AD155>84,Q114,\"\")),IF(AD155<45,Q114,IF(AD155>87,Q114,\"\")))","v":"dMO hors champ d'application"},null,"dMO hors champ d'application",null,null,"55 - 84","dMO","45 - 87",null,null,null,null,null,null,null,null,null,null,null,null,null,null,null,null,null,null,null,null,null,null,null,"TYPE",{"$f":"INDEX(AU116:AU119,AU115)","v":"VER"},"botanique:",{"$f":"C66","v":"G"}]
["valeur indicative sucres par régression base CB et type botanique",null,null,null,null,null,null,null,"MO",{"$f":"1000-J111","v":0},"g/kg MS","HEMmo",{"$f":"J116/J115*1000","v":{"$error":"#DIV/0!"}},null,null,null,null,null,null,null,null,null,null,null,null,null," ",null,null,null,null,null,null,null,null,null,null,null,null,null,null,null,null,null,null,null,{"$f":"B60","v":1},null,{"$f":"B66","v":1}]
["potentiel production lait selon NEL par kg MS (NEL/3.14)",null,null,null,null,null,null,null,"HEM",{"$f":"J113-J112","v":0},"g/kg MS",null,null,null,null,null,null,null,null,null,null,null,null,null,null,null,null,null,null,null,null,null,null,null,null,null,null,null,null,null,null,null,null,null,null,"en vert","VER"]
["potentiel production lait selon PAIE par kg MS (PAIE/50)",null,null,null,null,null,null,null,"ENA",{"$f":"J115-J109-J110-J114","v":0},"g/kg MS",null,null,null,null,null,null,null,null,null,null,null,null,null,null,null,null,null,null,null,null,null,null,null,null,null,null,null,null,null,null,null,null,null,null,"ensilage","ENS"]
["potentiel production lait selon PAIN par kg MS (PAIN/50)",null,null,null,null,null,null,null,null,null,null,null,null,null,null,null,null,null,null,null,null,null,null,null,null,null,null,null,null,null,null,null,null,null,null,null,null,null,null,null,null,null,null,null,null,"sec","SEC"]
["équilibre protéines/énergie (20g lactation, 18g taries & repos, 19g engrais)",null,null,null,null,null,null,null,null,null,null,null,null,null,null,null,null,null,null,null,null,null,null,null,null,null,null,null,null,null,null,null,null,null,null,null,null,null,null,null,null,null,null,null,null,"déshydraté artificiellement","DZU"]
["* par défaut, d'autres valeurs peuvent être données, mais implique initialisation pour nouveau calcul",null,null,null,null,null,null,null,null,null,null,null,null,null,"corrections 2017 dMo selon cycles et stades",null,null,null,null,null,null,null,null,"dMO corrigée",{"$f":"SUM(Z125:AI139)+BC122+AC145","v":{"$error":"#VALUE!"}},"correction dMo selon cycles et stades des espèces pures",{"$f":"P120","v":0},null,null,null,null,null,null,null,null,null,"correction cycle sans stade donné",null,null,null,null,null,null,"correction sans stades",null,null,null,"stade manque"]
[null,null,null,null,null,null,null,null,null,null,null,null,null,null,"cycle position",1," = cycle",{"$f":"P121-1","v":0},null,null,null,null,null,null,null,"cycle",{"$f":"P121","v":1},"1=sans correct; 2=cycle 1;3=cycle 2+",null,null,null,null,null,null,null,null,null,null,null,null,null,null,null,"1er cycle",null,null,null,"2em et suivants",null,null,null,"1er","2ème ss","pour cycle","correct selon conserve:"]
[null,null,null,null,null,null,null,null,null,null,null,null,null,null,"stade position",1," = stade",{"$f":"P122-1","v":0},null,null,null,null,null,null,null,"stade",{"$f":"P122","v":1},"1=sans correct; 2=std 2;3=std 3; 4=std 4",null,null,null,null,null,null,null,null,null,null,null,null,null,null,null,"herbe","ensilage","sec","déshydr.","herbe","ensilage","sec","déshydr.",null,null,{"$f":"AA121-1","v":0},{"$f":"IF(AND(AA121>1,AA122=1),SUM(BC125:BC139),0)","v":0},{"$f":"IF(BC122=0,0,BC122+AC145)","v":0},"dMO corrigée"]
["corrections pour ensilages",null,null,"NEL, NEV","PAIE","PAIN",1,"MS",null,"NEL","NEV","PAIE","PAIN",null,null,"1er cycle",null,null,null,null,"repousses",null,null,null,null,"1er cycle",null,null,null,null,"repousses",null,null,null,null,null,null,"1er cycle",null,null,"repousses",null,null,null,null,null,null,null,null,null,null,null,null,null,null,null,"selon cycle"]
["MS <20%",null,null,-1,-6,0,1,"sans corrections =1",null,{"$f":"IF(G124=1,0,IF(G123=0,0,IF(G123<20,D124,IF(G123>50,D125,0))))","v":0},{"$f":"IF(G124=1,0,IF(G123=0,0,IF(G123<20,D124,IF(G123>50,D125,0))))","v":0},{"$f":"IF(G124=1,0,IF(G123=0,0,IF(G123<20,E124,IF(G123>50,E125,0))))","v":0},{"$f":"IF(G124=1,0,IF(G123=0,0,IF(G123<20,F124,IF(G123>50,F125,0))))","v":0},null,null,"stade 1","stade 2","stade 3","stade 4","stade 5","stade 1","stade 2","stade 3","stade 4","stade 5","stade 1","stade 2","stade 3","stade 4","stade 5","stade 1","stade 2","stade 3","stade 4","stade 5",null,null,"stade 2","stade 3","stade 4","stade 2","stade 3","stade 4","moy st. 2-3","moy st. 2-3","moy st. 3-4","moy st. 2-3","moy st. 2-3","moy st. 2-3","moy st. 3-4","moy st. 2-3",null,null,null,null,null,"sans stade mais "]
["MS >50%",null,null,-1,6,0,null,null,null,null,null,null,null,null,"G",5,5,4,3,0,-2,-2,-2,-2,-3,{"$f":"IF($P$121=2,IF($P$122=2,IF($AC$145=0,\"\",IF($B$66=1,P125,\"\")),\"\"),\"\")","v":""},{"$f":"IF($P$121=2,IF($P$122=3,IF($AC$145=0,\"\",IF($B$66=1,Q125,\"\")),\"\"),\"\")","v":""},{"$f":"IF($P$121=2,IF($P$122=4,IF($AC$145=0,\"\",IF($B$66=1,R125,\"\")),\"\"),\"\")","v":""},{"$f":"IF($P$121=2,IF($P$122=5,IF($AC$145=0,\"\",IF($B$66=1,S125,\"\")),\"\"),\"\")","v":""},{"$f":"IF($P$121=2,IF($P$122=6,IF($AC$145=0,\"\",IF($B$66=1,T125,\"\")),\"\"),\"\")","v":""},{"$f":"IF($P$121=3,IF($P$122=2,IF($AC$145=0,\"\",IF($B$66=1,U125,\"\")),\"\"),\"\")","v":""},{"$f":"IF($P$121=3,IF($P$122=3,IF($AC$145=0,\"\",IF($B$66=1,V125,\"\")),\"\"),\"\")","v":""},{"$f":"IF($P$121=3,IF($P$122=4,IF($AC$145=0,\"\",IF($B$66=1,W125,\"\")),\"\"),\"\")","v":""},{"$f":"IF($P$121=3,IF($P$122=5,IF($AC$145=0,\"\",IF($B$66=1,X125,\"\")),\"\"),\"\")","v":""},{"$f":"IF($P$121=3,IF($P$122=6,IF($AC$145=0,\"\",IF($B$66=1,Y125,\"\")),\"\"),\"\")","v":""},null,"G",{"$f":"Q125","v":5},{"$f":"R125","v":4},3,{"$f":"V125","v":-2},{"$f":"W125","v":-2},-2,{"$f":"ROUND(AVERAGE(AL125:AM125),1)","v":4.5},{"$f":"ROUND(AVERAGE(AL125:AM125),1)","v":4.5},{"$f":"ROUND(AVERAGE(AM125:AN125),1)","v":3.5},{"$f":"ROUND(AVERAGE(AL125:AM125),1)","v":4.5},{"$f":"ROUND(AVERAGE(AO125:AP125),1)","v":-2},{"$f":"ROUND(AVERAGE(AO125:AP125),1)","v":-2},{"$f":"ROUND(AVERAGE(AP125:AQ125),1)","v":-2},{"$f":"ROUND(AVERAGE(AO125:AP125),1)","v":-2},{"$f":"IF($AW$115=1,AR125,IF($AW$115=2,AS125,IF($AW$115=3,AT125,AU125)))","v":4.5},{"$f":"IF($AW$115=1,AW125,IF($AW$115=2,AW125,IF($AW$115=3,AX125,AY125)))","v":-2},{"$f":"IF($BB$122+1=2,AZ125,BA125)","v":-2},{"$f":"IF($AW$115=1,BB125,\"\")","v":-2},null,"conserve"]
["normal",null,null,null,null,null,1,null,null,null,null,null,null,null,"GR",6,6,5,5,3,-1,-1,-2,-4,-4,{"$f":"IF($P$121=2,IF($P$122=2,IF($AC$145=0,\"\",IF($B$66=2,P126,\"\")),\"\"),\"\")","v":""},{"$f":"IF($P$121=2,IF($P$122=3,IF($AC$145=0,\"\",IF($B$66=2,Q126,\"\")),\"\"),\"\")","v":""},{"$f":"IF($P$121=2,IF($P$122=4,IF($AC$145=0,\"\",IF($B$66=2,R126,\"\")),\"\"),\"\")","v":""},{"$f":"IF($P$121=2,IF($P$122=5,IF($AC$145=0,\"\",IF($B$66=2,S126,\"\")),\"\"),\"\")","v":""},{"$f":"IF($P$121=2,IF($P$122=6,IF($AC$145=0,\"\",IF($B$66=2,T126,\"\")),\"\"),\"\")","v":""},{"$f":"IF($P$121=3,IF($P$122=2,IF($AC$145=0,\"\",IF($B$66=2,U126,\"\")),\"\"),\"\")","v":""},{"$f":"IF($P$121=3,IF($P$122=3,IF($AC$145=0,\"\",IF($B$66=2,V126,\"\")),\"\"),\"\")","v":""},{"$f":"IF($P$121=3,IF($P$122=4,IF($AC$145=0,\"\",IF($B$66=2,W126,\"\")),\"\"),\"\")","v":""},{"$f":"IF($P$121=3,IF($P$122=5,IF($AC$145=0,\"\",IF($B$66=2,X126,\"\")),\"\"),\"\")","v":""},{"$f":"IF($P$121=3,IF($P$122=6,IF($AC$145=0,\"\",IF($B$66=2,Y126,\"\")),\"\"),\"\")","v":""},null,"GR",{"$f":"Q126","v":6},5,5,{"$f":"V126","v":-1},-2,-4,{"$f":"ROUND(AVERAGE(AL126:AM126),1)","v":5.5},{"$f":"ROUND(AVERAGE(AL126:AM126),1)","v":5.5},5,{"$f":"ROUND(AVERAGE(AL126:AM126),1)","v":5.5},{"$f":"ROUND(AVERAGE(AO126:AP126),1)","v":-1.5},{"$f":"ROUND(AVERAGE(AO126:AP126),1)","v":-1.5},-3,{"$f":"ROUND(AVERAGE(AO126:AP126),1)","v":-1.5},{"$f":"IF($AV$115=1,AR126,IF($AV$115=2,AS126,IF($AV$115=3,AT126,AU126)))","v":5.5},{"$f":"IF($AV$115=1,AV126,IF($AV$115=2,AW126,IF($AV$115=3,AX126,AY126)))","v":-1.5},-1.5,{"$f":"IF($AW$115=2,BB126,\"\")","v":""}]
["qualité fermentaire défectueuse",null,null,-2,-6,0,1,{"$f":"INDEX(A126:A128,G127)","v":"normal"},null,{"$f":"IF(G127=2,D127,IF(G127=3,D128,0))","v":0},{"$f":"IF(G127=2,D127,IF(G127=3,D128,0))","v":0},{"$f":"IF(G127=2,E127,IF(G127=3,E128,0))","v":0},{"$f":"IF(G127=2,F127,IF(G127=3,F1192,0))","v":0},null,"E",4,4,4,3,0,-2,-2,-3,-3,-3,{"$f":"IF($P$121=2,IF($P$122=2,IF($AC$145=0,\"\",IF($B$66=3,P127,\"\")),\"\"),\"\")","v":""},{"$f":"IF($P$121=2,IF($P$122=3,IF($AC$145=0,\"\",IF($B$66=3,Q127,\"\")),\"\"),\"\")","v":""},{"$f":"IF($P$121=2,IF($P$122=4,IF($AC$145=0,\"\",IF($B$66=3,R127,\"\")),\"\"),\"\")","v":""},{"$f":"IF($P$121=2,IF($P$122=5,IF($AC$145=0,\"\",IF($B$66=3,S127,\"\")),\"\"),\"\")","v":""},{"$f":"IF($P$121=2,IF($P$122=6,IF($AC$145=0,\"\",IF($B$66=3,T127,\"\")),\"\"),\"\")","v":""},{"$f":"IF($P$121=3,IF($P$122=2,IF($AC$145=0,\"\",IF($B$66=3,U127,\"\")),\"\"),\"\")","v":""},{"$f":"IF($P$121=3,IF($P$122=3,IF($AC$145=0,\"\",IF($B$66=3,V127,\"\")),\"\"),\"\")","v":""},{"$f":"IF($P$121=3,IF($P$122=4,IF($AC$145=0,\"\",IF($B$66=3,W127,\"\")),\"\"),\"\")","v":""},{"$f":"IF($P$121=3,IF($P$122=5,IF($AC$145=0,\"\",IF($B$66=3,X127,\"\")),\"\"),\"\")","v":""},{"$f":"IF($P$121=3,IF($P$122=6,IF($AC$145=0,\"\",IF($B$66=3,Y127,\"\")),\"\"),\"\")","v":""},null,"E",4,4,3,-2,-3,-3,4,4,3.5,4,-2.5,-2.5,-3,-2.5,4,-2.5,-2.5,{"$f":"IF($AW$115=3,BB127,\"\")","v":""}]
["qualité fermentaire mauvaise",null,null,-5,-15,-3,null,null,null,null,null,null,null,null,"ER",5,5,5,5,2,-1,-1,-2,-3,-3,{"$f":"IF($P$121=2,IF($P$122=2,IF($AC$145=0,\"\",IF($B$66=4,P128,\"\")),\"\"),\"\")","v":""},{"$f":"IF($P$121=2,IF($P$122=3,IF($AC$145=0,\"\",IF($B$66=4,Q128,\"\")),\"\"),\"\")","v":""},{"$f":"IF($P$121=2,IF($P$122=4,IF($AC$145=0,\"\",IF($B$66=4,R128,\"\")),\"\"),\"\")","v":""},{"$f":"IF($P$121=2,IF($P$122=5,IF($AC$145=0,\"\",IF($B$66=4,S128,\"\")),\"\"),\"\")","v":""},{"$f":"IF($P$121=2,IF($P$122=6,IF($AC$145=0,\"\",IF($B$66=4,T128,\"\")),\"\"),\"\")","v":""},{"$f":"IF($P$121=3,IF($P$122=2,IF($AC$145=0,\"\",IF($B$66=4,U128,\"\")),\"\"),\"\")","v":""},{"$f":"IF($P$121=3,IF($P$122=3,IF($AC$145=0,\"\",IF($B$66=4,V128,\"\")),\"\"),\"\")","v":""},{"$f":"IF($P$121=3,IF($P$122=4,IF($AC$145=0,\"\",IF($B$66=4,W128,\"\")),\"\"),\"\")","v":""},{"$f":"IF($P$121=3,IF($P$122=5,IF($AC$145=0,\"\",IF($B$66=4,X128,\"\")),\"\"),\"\")","v":""},{"$f":"IF($P$121=3,IF($P$122=6,IF($AC$145=0,\"\",IF($B$66=4,Y128,\"\")),\"\"),\"\")","v":""},null,"ER",5,5,5,-1,-2,-3,5,5,5,5,-1.5,-1.5,-2.5,-1.5,5,-1.5,-1.5,{"$f":"IF($AW$115=4,BB128,\"\")","v":""}]
["normal",null,null,null,null,null,1,null,null,null,null,null,null,null,"L",3,4,5,5,3,2,1,0,0,-1,{"$f":"IF($P$121=2,IF($P$122=2,IF($AC$145=0,\"\",IF($B$66=5,P129,\"\")),\"\"),\"\")","v":""},{"$f":"IF($P$121=2,IF($P$122=3,IF($AC$145=0,\"\",IF($B$66=5,Q129,\"\")),\"\"),\"\")","v":""},{"$f":"IF($P$121=2,IF($P$122=4,IF($AC$145=0,\"\",IF($B$66=5,R129,\"\")),\"\"),\"\")","v":""},{"$f":"IF($P$121=2,IF($P$122=5,IF($AC$145=0,\"\",IF($B$66=5,S129,\"\")),\"\"),\"\")","v":""},{"$f":"IF($P$121=2,IF($P$122=6,IF($AC$145=0,\"\",IF($B$66=5,T129,\"\")),\"\"),\"\")","v":""},{"$f":"IF($P$121=3,IF($P$122=2,IF($AC$145=0,\"\",IF($B$66=5,U129,\"\")),\"\"),\"\")","v":""},{"$f":"IF($P$121=3,IF($P$122=3,IF($AC$145=0,\"\",IF($B$66=5,V129,\"\")),\"\"),\"\")","v":""},{"$f":"IF($P$121=3,IF($P$122=4,IF($AC$145=0,\"\",IF($B$66=5,W129,\"\")),\"\"),\"\")","v":""},{"$f":"IF($P$121=3,IF($P$122=5,IF($AC$145=0,\"\",IF($B$66=5,X129,\"\")),\"\"),\"\")","v":""},{"$f":"IF($P$121=3,IF($P$122=6,IF($AC$145=0,\"\",IF($B$66=5,Y129,\"\")),\"\"),\"\")","v":""},null,"L",4,5,5,1,0,0,4.5,4.5,5,4.5,0.5,0.5,0,0.5,4.5,0.5,0.5,{"$f":"IF($AW$115=5,BB129,\"\")","v":""}]
["postfermentations légèrement échauffé",null,null,-4,-15,-3,1,{"$f":"INDEX(A129:A130,G130)","v":"normal"},null,{"$f":"IF(G130=2,D130,0)","v":0},{"$f":"IF(G130=2,D130,0)","v":0},{"$f":"IF(G130=2,E130,0)","v":0},{"$f":"IF(G130=2,F130,0)","v":0},null,"DF",3,3,3,3,2,-2,-2,-2,-2,-4,{"$f":"IF($P$121=2,IF($P$122=2,IF($AC$145=0,\"\",IF($B$66=6,P130,\"\")),\"\"),\"\")","v":""},{"$f":"IF($P$121=2,IF($P$122=3,IF($AC$145=0,\"\",IF($B$66=6,Q130,\"\")),\"\"),\"\")","v":""},{"$f":"IF($P$121=2,IF($P$122=4,IF($AC$145=0,\"\",IF($B$66=6,R130,\"\")),\"\"),\"\")","v":""},{"$f":"IF($P$121=2,IF($P$122=5,IF($AC$145=0,\"\",IF($B$66=6,S130,\"\")),\"\"),\"\")","v":""},{"$f":"IF($P$121=2,IF($P$122=6,IF($AC$145=0,\"\",IF($B$66=6,T130,\"\")),\"\"),\"\")","v":""},{"$f":"IF($P$121=3,IF($P$122=2,IF($AC$145=0,\"\",IF($B$66=6,U130,\"\")),\"\"),\"\")","v":""},{"$f":"IF($P$121=3,IF($P$122=3,IF($AC$145=0,\"\",IF($B$66=6,V130,\"\")),\"\"),\"\")","v":""},{"$f":"IF($P$121=3,IF($P$122=4,IF($AC$145=0,\"\",IF($B$66=6,W130,\"\")),\"\"),\"\")","v":""},{"$f":"IF($P$121=3,IF($P$122=5,IF($AC$145=0,\"\",IF($B$66=6,X130,\"\")),\"\"),\"\")","v":""},{"$f":"IF($P$121=3,IF($P$122=6,IF($AC$145=0,\"\",IF($B$66=6,Y130,\"\")),\"\"),\"\")","v":""},null,"DF",3,3,3,-2,-2,-2,3,3,3,3,-2,-2,-2,-2,3,-2,-2,{"$f":"IF($AW$115=6,BB130,\"\")","v":""}]
[null,null,null,null,null,null,null,null,"% corrections",{"$f":"SUM(J124,J127,J130)/100","v":0},{"$f":"SUM(K124,K127,K130)/100","v":0},{"$f":"SUM(L124,L127,L130)/100","v":0},{"$f":"SUM(M124,M127,M130)/100","v":0},null,"DT",2,2,2,-1,-5,1,-1,-4,-6,-11,{"$f":"IF($P$121=2,IF($P$122=2,IF($AC$145=0,\"\",IF($B$66=7,P131,\"\")),\"\"),\"\")","v":""},{"$f":"IF($P$121=2,IF($P$122=3,IF($AC$145=0,\"\",IF($B$66=7,Q131,\"\")),\"\"),\"\")","v":""},{"$f":"IF($P$121=2,IF($P$122=4,IF($AC$145=0,\"\",IF($B$66=7,R131,\"\")),\"\"),\"\")","v":""},{"$f":"IF($P$121=2,IF($P$122=5,IF($AC$145=0,\"\",IF($B$66=7,S131,\"\")),\"\"),\"\")","v":""},{"$f":"IF($P$121=2,IF($P$122=6,IF($AC$145=0,\"\",IF($B$66=7,T131,\"\")),\"\"),\"\")","v":""},{"$f":"IF($P$121=3,IF($P$122=2,IF($AC$145=0,\"\",IF($B$66=7,U131,\"\")),\"\"),\"\")","v":""},{"$f":"IF($P$121=3,IF($P$122=3,IF($AC$145=0,\"\",IF($B$66=7,V131,\"\")),\"\"),\"\")","v":""},{"$f":"IF($P$121=3,IF($P$122=4,IF($AC$145=0,\"\",IF($B$66=7,W131,\"\")),\"\"),\"\")","v":""},{"$f":"IF($P$121=3,IF($P$122=5,IF($AC$145=0,\"\",IF($B$66=7,X131,\"\")),\"\"),\"\")","v":""},{"$f":"IF($P$121=3,IF($P$122=6,IF($AC$145=0,\"\",IF($B$66=7,Y131,\"\")),\"\"),\"\")","v":""},null,"DT",2,2,-1,-1,-4,-6,2,2,0.5,2,-2.5,-2.5,-5,-2.5,2,-2.5,-2.5,{"$f":"IF($AW$115=7,BB131,\"\")","v":""}]
[null,null,null,null,null,null,null,null,null,null,null,null,null,null,"Dactyle",-2,0,3,5,4,1,0,0,-3,-2,{"$f":"IF($P$121=2,IF($P$122=2,IF($AC$145=0,\"\",IF($B$66=9,P132,\"\")),\"\"),\"\")","v":""},{"$f":"IF($P$121=2,IF($P$122=3,IF($AC$145=0,\"\",IF($B$66=9,Q132,\"\")),\"\"),\"\")","v":""},{"$f":"IF($P$121=2,IF($P$122=4,IF($AC$145=0,\"\",IF($B$66=9,R132,\"\")),\"\"),\"\")","v":""},{"$f":"IF($P$121=2,IF($P$122=5,IF($AC$145=0,\"\",IF($B$66=9,S132,\"\")),\"\"),\"\")","v":""},{"$f":"IF($P$121=2,IF($P$122=6,IF($AC$145=0,\"\",IF($B$66=9,T132,\"\")),\"\"),\"\")","v":""},{"$f":"IF($P$121=3,IF($P$122=2,IF($AC$145=0,\"\",IF($B$66=9,U132,\"\")),\"\"),\"\")","v":""},{"$f":"IF($P$121=3,IF($P$122=3,IF($AC$145=0,\"\",IF($B$66=9,V132,\"\")),\"\"),\"\")","v":""},{"$f":"IF($P$121=3,IF($P$122=4,IF($AC$145=0,\"\",IF($B$66=9,W132,\"\")),\"\"),\"\")","v":""},{"$f":"IF($P$121=3,IF($P$122=5,IF($AC$145=0,\"\",IF($B$66=9,X132,\"\")),\"\"),\"\")","v":""},{"$f":"IF($P$121=3,IF($P$122=6,IF($AC$145=0,\"\",IF($B$66=9,Y132,\"\")),\"\"),\"\")","v":""},null,"Dactyle",0,3,5,0,0,-3,1.5,1.5,4,1.5,0,0,-1.5,0,1.5,0,0,{"$f":"IF($AW$115=9,BB132,\"\")","v":""}]
["corrections pour fourrages secs",null,null,"NEL, NEV","PAIE","PAIN",1,null,null,"NEL","NEV","PAIE","PAIN",null,"RG anglais",-2,0,3,5,5,-1,-2,-4,-4,-4,{"$f":"IF($P$121=2,IF($P$122=2,IF($AC$145=0,\"\",IF($B$66=10,P133,\"\")),\"\"),\"\")","v":""},{"$f":"IF($P$121=2,IF($P$122=3,IF($AC$145=0,\"\",IF($B$66=10,Q133,\"\")),\"\"),\"\")","v":""},{"$f":"IF($P$121=2,IF($P$122=4,IF($AC$145=0,\"\",IF($B$66=10,R133,\"\")),\"\"),\"\")","v":""},{"$f":"IF($P$121=2,IF($P$122=5,IF($AC$145=0,\"\",IF($B$66=10,S133,\"\")),\"\"),\"\")","v":""},{"$f":"IF($P$121=2,IF($P$122=6,IF($AC$145=0,\"\",IF($B$66=10,T133,\"\")),\"\"),\"\")","v":""},{"$f":"IF($P$121=3,IF($P$122=2,IF($AC$145=0,\"\",IF($B$66=10,U133,\"\")),\"\"),\"\")","v":""},{"$f":"IF($P$121=3,IF($P$122=3,IF($AC$145=0,\"\",IF($B$66=10,V133,\"\")),\"\"),\"\")","v":""},{"$f":"IF($P$121=3,IF($P$122=4,IF($AC$145=0,\"\",IF($B$66=10,W133,\"\")),\"\"),\"\")","v":""},{"$f":"IF($P$121=3,IF($P$122=5,IF($AC$145=0,\"\",IF($B$66=10,X133,\"\")),\"\"),\"\")","v":""},{"$f":"IF($P$121=3,IF($P$122=6,IF($AC$145=0,\"\",IF($B$66=10,Y133,\"\")),\"\"),\"\")","v":""},null,"RG anglais",0,3,5,-2,-4,-4,1.5,1.5,4,1.5,-3,-3,-4,-3,1.5,-3,-3,{"$f":"IF($AW$115=10,BB133,\"\")","v":""}]
["séchage au sol",null,null,-4,-3,0,1,null,null,{"$f":"IF(G134=2,D134,0)","v":0},{"$f":"IF(G134=2,D134,0)","v":0},{"$f":"IF(G134=2,E134,0)","v":0},{"$f":"IF(G134=2,F134,0)","v":0},null,"RG itallien",-3,-1,3,4,-2,0,3,4,2,-3,{"$f":"IF($P$121=2,IF($P$122=2,IF($AC$145=0,\"\",IF($B$66=11,P134,\"\")),\"\"),\"\")","v":""},{"$f":"IF($P$121=2,IF($P$122=3,IF($AC$145=0,\"\",IF($B$66=11,Q134,\"\")),\"\"),\"\")","v":""},{"$f":"IF($P$121=2,IF($P$122=4,IF($AC$145=0,\"\",IF($B$66=11,R134,\"\")),\"\"),\"\")","v":""},{"$f":"IF($P$121=2,IF($P$122=5,IF($AC$145=0,\"\",IF($B$66=11,S134,\"\")),\"\"),\"\")","v":""},{"$f":"IF($P$121=2,IF($P$122=6,IF($AC$145=0,\"\",IF($B$66=11,T134,\"\")),\"\"),\"\")","v":""},{"$f":"IF($P$121=3,IF($P$122=2,IF($AC$145=0,\"\",IF($B$66=11,U134,\"\")),\"\"),\"\")","v":""},{"$f":"IF($P$121=3,IF($P$122=3,IF($AC$145=0,\"\",IF($B$66=11,V134,\"\")),\"\"),\"\")","v":""},{"$f":"IF($P$121=3,IF($P$122=4,IF($AC$145=0,\"\",IF($B$66=11,W134,\"\")),\"\"),\"\")","v":""},{"$f":"IF($P$121=3,IF($P$122=5,IF($AC$145=0,\"\",IF($B$66=11,X134,\"\")),\"\"),\"\")","v":""},{"$f":"IF($P$121=3,IF($P$122=6,IF($AC$145=0,\"\",IF($B$66=11,Y134,\"\")),\"\"),\"\")","v":""},null,"RG itallien",-1,3,4,3,4,2,1,1,3.5,1,3.5,3.5,3,3.5,1,3.5,3.5,{"$f":"IF($AW$115=11,BB134,\"\")","v":""}]
["1 jour de pluie",null,null,-5,-8,-2,1,null,null,{"$f":"IF(G135=2,D135,IF(G135=3,D136,0))","v":0},{"$f":"IF(G135=2,D135,IF(G135=3,D136,0))","v":0},{"$f":"IF(G135=2,E135,IF(G135=3,E136,0))","v":0},{"$f":"IF(G135=2,F135,IF(H135=3,F136,0))","v":0},null,"Vulpin",0,5,3,2,0,-2,-3,-3,-3,-3,{"$f":"IF($P$121=2,IF($P$122=2,IF($AC$145=0,\"\",IF($B$66=12,P135,\"\")),\"\"),\"\")","v":""},{"$f":"IF($P$121=2,IF($P$122=3,IF($AC$145=0,\"\",IF($B$66=12,Q135,\"\")),\"\"),\"\")","v":""},{"$f":"IF($P$121=2,IF($P$122=4,IF($AC$145=0,\"\",IF($B$66=12,R135,\"\")),\"\"),\"\")","v":""},{"$f":"IF($P$121=2,IF($P$122=5,IF($AC$145=0,\"\",IF($B$66=12,S135,\"\")),\"\"),\"\")","v":""},{"$f":"IF($P$121=2,IF($P$122=6,IF($AC$145=0,\"\",IF($B$66=12,T135,\"\")),\"\"),\"\")","v":""},{"$f":"IF($P$121=3,IF($P$122=2,IF($AC$145=0,\"\",IF($B$66=12,U135,\"\")),\"\"),\"\")","v":""},{"$f":"IF($P$121=3,IF($P$122=3,IF($AC$145=0,\"\",IF($B$66=12,V135,\"\")),\"\"),\"\")","v":""},{"$f":"IF($P$121=3,IF($P$122=4,IF($AC$145=0,\"\",IF($B$66=12,W135,\"\")),\"\"),\"\")","v":""},{"$f":"IF($P$121=3,IF($P$122=5,IF($AC$145=0,\"\",IF($B$66=12,X135,\"\")),\"\"),\"\")","v":""},{"$f":"IF($P$121=3,IF($P$122=6,IF($AC$145=0,\"\",IF($B$66=12,Y135,\"\")),\"\"),\"\")","v":""},null,"Vulpin",5,3,2,-3,-3,-3,4,4,2.5,4,-3,-3,-3,-3,4,-3,-3,{"$f":"IF($AW$115=12,BB135,\"\")","v":""}]
["2 jours et plus de pluie",null,null,-8,-15,-3,1,null,null,null,null,null,null,null,"Trèfle blanc",2,3,3,2,1,1,1,1,0,-3,{"$f":"IF($P$121=2,IF($P$122=2,IF($AC$145=0,\"\",IF($B$66=13,P136,\"\")),\"\"),\"\")","v":""},{"$f":"IF($P$121=2,IF($P$122=3,IF($AC$145=0,\"\",IF($B$66=13,Q136,\"\")),\"\"),\"\")","v":""},{"$f":"IF($P$121=2,IF($P$122=4,IF($AC$145=0,\"\",IF($B$66=13,R136,\"\")),\"\"),\"\")","v":""},{"$f":"IF($P$121=2,IF($P$122=5,IF($AC$145=0,\"\",IF($B$66=13,S136,\"\")),\"\"),\"\")","v":""},{"$f":"IF($P$121=2,IF($P$122=6,IF($AC$145=0,\"\",IF($B$66=13,T136,\"\")),\"\"),\"\")","v":""},{"$f":"IF($P$121=3,IF($P$122=2,IF($AC$145=0,\"\",IF($B$66=13,U136,\"\")),\"\"),\"\")","v":""},{"$f":"IF($P$121=3,IF($P$122=3,IF($AC$145=0,\"\",IF($B$66=13,V136,\"\")),\"\"),\"\")","v":""},{"$f":"IF($P$121=3,IF($P$122=4,IF($AC$145=0,\"\",IF($B$66=13,W136,\"\")),\"\"),\"\")","v":""},{"$f":"IF($P$121=3,IF($P$122=5,IF($AC$145=0,\"\",IF($B$66=13,X136,\"\")),\"\"),\"\")","v":""},{"$f":"IF($P$121=3,IF($P$122=6,IF($AC$145=0,\"\",IF($B$66=13,Y136,\"\")),\"\"),\"\")","v":""},null,"Trèfle blanc",3,3,2,1,1,0,3,3,2.5,3,1,1,0.5,1,3,1,1,{"$f":"IF($AW$115=13,BB136,\"\")","v":""}]
["Echauffement, légèrement brun",null,null,0,3,0,1,null,null,{"$f":"IF(G137=2,D137,IF(G137=3,D138,0))","v":0},{"$f":"IF(G137=2,D137,IF(G137=3,D138,0))","v":0},{"$f":"IF(G137=2,E137,IF(G137=3,E138,0))","v":0},{"$f":"IF(G137=2,F137,IF(H137=3,F138,0))","v":0},null,"Trèfle violet",0,3,3,2,0,-2,-1,-1,-1,-3,{"$f":"IF($P$121=2,IF($P$122=2,IF($AC$145=0,\"\",IF($B$66=14,P137,\"\")),\"\"),\"\")","v":""},{"$f":"IF($P$121=2,IF($P$122=3,IF($AC$145=0,\"\",IF($B$66=14,Q137,\"\")),\"\"),\"\")","v":""},{"$f":"IF($P$121=2,IF($P$122=4,IF($AC$145=0,\"\",IF($B$66=14,R137,\"\")),\"\"),\"\")","v":""},{"$f":"IF($P$121=2,IF($P$122=5,IF($AC$145=0,\"\",IF($B$66=14,S137,\"\")),\"\"),\"\")","v":""},{"$f":"IF($P$121=2,IF($P$122=6,IF($AC$145=0,\"\",IF($B$66=14,T137,\"\")),\"\"),\"\")","v":""},{"$f":"IF($P$121=3,IF($P$122=2,IF($AC$145=0,\"\",IF($B$66=14,U137,\"\")),\"\"),\"\")","v":""},{"$f":"IF($P$121=3,IF($P$122=3,IF($AC$145=0,\"\",IF($B$66=14,V137,\"\")),\"\"),\"\")","v":""},{"$f":"IF($P$121=3,IF($P$122=4,IF($AC$145=0,\"\",IF($B$66=14,W137,\"\")),\"\"),\"\")","v":""},{"$f":"IF($P$121=3,IF($P$122=5,IF($AC$145=0,\"\",IF($B$66=14,X137,\"\")),\"\"),\"\")","v":""},{"$f":"IF($P$121=3,IF($P$122=6,IF($AC$145=0,\"\",IF($B$66=14,Y137,\"\")),\"\"),\"\")","v":""},null,"Trèfle violet",3,3,2,-1,-1,-1,3,3,2.5,3,-1,-1,-1,-1,3,-1,-1,{"$f":"IF($AW$115=14,BB137,\"\")","v":""}]
["Echauffement, brun odeur de roussi",null,null,-5,-1,-2,null,null,"foins / regains",null,null,null,null,null,"Luzerne",1,1,1,1,1,-3,-2,-1,-2,-1,{"$f":"IF($P$121=2,IF($P$122=2,IF($AC$145=0,\"\",IF($B$66=15,P138,\"\")),\"\"),\"\")","v":""},{"$f":"IF($P$121=2,IF($P$122=3,IF($AC$145=0,\"\",IF($B$66=15,Q138,\"\")),\"\"),\"\")","v":""},{"$f":"IF($P$121=2,IF($P$122=4,IF($AC$145=0,\"\",IF($B$66=15,R138,\"\")),\"\"),\"\")","v":""},{"$f":"IF($P$121=2,IF($P$122=5,IF($AC$145=0,\"\",IF($B$66=15,S138,\"\")),\"\"),\"\")","v":""},{"$f":"IF($P$121=2,IF($P$122=6,IF($AC$145=0,\"\",IF($B$66=15,T138,\"\")),\"\"),\"\")","v":""},{"$f":"IF($P$121=3,IF($P$122=2,IF($AC$145=0,\"\",IF($B$66=15,U138,\"\")),\"\"),\"\")","v":""},{"$f":"IF($P$121=3,IF($P$122=3,IF($AC$145=0,\"\",IF($B$66=15,V138,\"\")),\"\"),\"\")","v":""},{"$f":"IF($P$121=3,IF($P$122=4,IF($AC$145=0,\"\",IF($B$66=15,W138,\"\")),\"\"),\"\")","v":""},{"$f":"IF($P$121=3,IF($P$122=5,IF($AC$145=0,\"\",IF($B$66=15,X138,\"\")),\"\"),\"\")","v":""},{"$f":"IF($P$121=3,IF($P$122=6,IF($AC$145=0,\"\",IF($B$66=15,Y138,\"\")),\"\"),\"\")","v":""},null,"Luzerne",1,1,1,-2,-1,-2,1,1,1,1,-1.5,-1.5,-1.5,-1.5,1,-1.5,-1.5,{"$f":"IF($AW$115=15,BB138,\"\")","v":""}]
[null,null,null,null,null,null,null,null,"% corrections",{"$f":"SUM(J134,J135,J137)/100","v":0},{"$f":"SUM(K134,K135,K137)/100","v":0},{"$f":"SUM(L134,L135,L137)/100","v":0},{"$f":"SUM(M134,M135,M137)/100","v":0},null,"indéterminé",5,5,5,4,4,-3,-3,-4,-3,-3,{"$f":"IF($P$121=2,IF($P$122=2,IF($AC$145=0,\"\",IF($B$66=8,P139,\"\")),\"\"),\"\")","v":""},{"$f":"IF($P$121=2,IF($P$122=3,IF($AC$145=0,\"\",IF($B$66=8,Q139,\"\")),\"\"),\"\")","v":""},{"$f":"IF($P$121=2,IF($P$122=4,IF($AC$145=0,\"\",IF($B$66=8,R139,\"\")),\"\"),\"\")","v":""},{"$f":"IF($P$121=2,IF($P$122=5,IF($AC$145=0,\"\",IF($B$66=8,S139,\"\")),\"\"),\"\")","v":""},{"$f":"IF($P$121=2,IF($P$122=6,IF($AC$145=0,\"\",IF($B$66=8,T139,\"\")),\"\"),\"\")","v":""},{"$f":"IF($P$121=3,IF($P$122=2,IF($AC$145=0,\"\",IF($B$66=8,U139,\"\")),\"\"),\"\")","v":""},{"$f":"IF($P$121=3,IF($P$122=3,IF($AC$145=0,\"\",IF($B$66=8,V139,\"\")),\"\"),\"\")","v":""},{"$f":"IF($P$121=3,IF($P$122=4,IF($AC$145=0,\"\",IF($B$66=8,W139,\"\")),\"\"),\"\")","v":""},{"$f":"IF($P$121=3,IF($P$122=5,IF($AC$145=0,\"\",IF($B$66=8,X139,\"\")),\"\"),\"\")","v":""},{"$f":"IF($P$121=3,IF($P$122=6,IF($AC$145=0,\"\",IF($B$66=8,Y139,\"\")),\"\"),\"\")","v":""},null,"indéterminé",5,5,4,-3,-4,-3,5,5,4.5,5,-3.5,-3.5,-3.5,-3.5,5,-3.5,-3.5,{"$f":"IF($AW$115=8,BB139,\"\")","v":""}]
[null,null,null,null,null,null,null,"corrections",{"$f":"INDEX(A61:A64,B60)","v":"en vert"},{"$f":"IF(B60=2,J131,IF(B60=3,J139,0))","v":0},{"$f":"IF(B60=2,K131,IF(B60=3,K139,0))","v":0},{"$f":"IF(B60=2,L131,IF(B60=3,L139,0))","v":0},{"$f":"IF(B60=2,M131,IF(B60=3,M139,0))","v":0}]
[{"$f":"CONCATENATE(B60,B66)","v":"11"}]
[]
[null,null,null,null,null,null,null,null,null,null,null,null,null,null,null,null,null,null,null,null,"données MA,CB existantes",null,null,null,null,null,null,null,null,null,"valeurs indicatives à partir mini régression issues des tables 2006"]
["EQUATIONS dMO et ADF, NDF, Sucres",null,null,null,null,null,null,null,null,null,null,null,null,null,null,"priorité ADF donné",null,null,null,null,null,{"$f":"SUM(N109:N110)","v":{"$error":"#DIV/0!"}},null,null,"conserve","bota",{"$f":"ISERROR(AA145)","v":false},"dMO donné prioritaire","dMO utilisée","dMO pour correction cycle-stade","ADFreg","ADFreg","NDFreg","NDFreg","SUCREreg","SUCREreg"]
[null,null,null,"MA","CB","ADF donné","NDF donné","CE","ADF reg2006","NDF reg","sucre reg","NDF(donné/reg)","ADF(donné/reg)","MO","MA/MO","CB/MO","ADF/MO","MA2/MO","CB2/MO","ADF2/MO","dMO par CB","dMO par ADF","LV99","dMO reg",null,null,{"$f":"SUM(AA146:AA209)","v":0},"dMO",{"$f":"IF(AA144=TRUE,\"\",IF(G13<>AA145,G13,AA145))","v":""},{"$f":"IF(Y120=0,AC145,Y120)","v":{"$error":"#VALUE!"}},null,{"$f":"(SUM(AF146:AF209))*G2/100","v":0},null,{"$f":"(SUM(AH146:AH209))*G2/100","v":0},null,{"$f":"(SUM(AJ146:AJ209))*G2/100","v":0}]
[null,"vert","G",{"$f":"$J$109","v":0},{"$f":"$J$110","v":0},{"$f":"$J$112","v":0},{"$f":"$J$113","v":0},{"$f":"$J$111","v":1000},{"$f":"IF(E146=0,\"\",1.0503*E146 + 18.642)","v":""},{"$f":"IF(E146=0,\"\", 1.753*E146 + 40.45)","v":""},{"$f":"IF(E146=0,\"\", -0.0035*E146^2 + 1.7676*E146 - 115.4)","v":""},{"$f":"IF(G146=\"\",J146,G146)","v":0},{"$f":"IF(F146=\"\",I146,F146)","v":0},{"$f":"1000-H146","v":0},{"$f":"D146/N146*1000","v":{"$error":"#DIV/0!"}},{"$f":"E146/N146*1000","v":{"$error":"#DIV/0!"}},{"$f":"M146/N146*1000","v":{"$error":"#DIV/0!"}},{"$f":"O146^2","v":{"$error":"#DIV/0!"}},{"$f":"P146^2","v":{"$error":"#DIV/0!"}},{"$f":"Q146^2","v":{"$error":"#DIV/0!"}},{"$f":"IF(E146=0,\"\",34+0.1654*O146+0.1776*P146-0.000257*R146-0.000391*S146)","v":""},{"$f":"IF(M146=0,\"\",25.7+0.1654*O146+0.2169*Q146-0.000256*R146-0.000413*T146)","v":""},{"$f":"IF(V144=0,\"\",84.8+0.0109*O146-0.000167*S146)","v":{"$error":"#DIV/0!"}},{"$f":"IF($J$60=1,U146,IF($J$60=2,V146,W146))","v":""},{"$f":"IF(X146=U146,\"dMO par CB\",IF(X146=V146,\"dMO par ADF\",\"dMO reg LV99\"))","v":"dMO par CB"},{"$f":"IF($C$60=\"VER\",X146,\"\")","v":""},{"$f":"IF($C$66=\"G\",Z146,0)","v":""},"G",null,null,{"$f":"IF($C$60=\"VER\",I146,\"\")","v":""},{"$f":"IF($C$66=\"G\",AE146,0)","v":""},{"$f":"IF($C$60=\"VER\",J146,\"\")","v":""},{"$f":"IF($C$66=\"G\",AG146,0)","v":""},{"$f":"IF($C$60=\"VER\",K146,\"\")","v":""},{"$f":"IF($C$66=\"G\",AI146,0)","v":""}]
[null,"vert","GR",0,0,0,0,1000,{"$f":"IF(E147=0,\"\", 1.0649*E147 + 14.478)","v":""},{"$f":"IF(E147=0,\"\", 1.913*E147 - 1.668)","v":""},{"$f":"IF(E147=0,\"\", 0.0037*E147^2 - 1.8885*E147 + 396.24)","v":""},{"$f":"IF(G147=\"\",J147,G147)","v":0},{"$f":"IF(F147=\"\",I147,F147)","v":0},0,{"$error":"#DIV/0!"},{"$error":"#DIV/0!"},{"$f":"M147/N147*1000","v":{"$error":"#DIV/0!"}},{"$f":"O147^2","v":{"$error":"#DIV/0!"}},{"$error":"#DIV/0!"},{"$error":"#DIV/0!"},{"$f":"IF(E147=0,\"\",21.9+0.1209*O147+0.358*P147-0.000186*R147-0.000794*S147)","v":""},{"$f":"IF(M147=0,\"\",13.3+0.1209*O147+0.3823*Q147-0.000186*R147-0.000746*T147)","v":""},{"$f":"IF(V144=0,\"\",87.9+0.0006*O147+0.0028*P147-0.000179*S147)","v":{"$error":"#DIV/0!"}},{"$f":"IF($J$60=1,U147,IF($J$60=2,V147,W147))","v":""},{"$f":"IF(X147=U147,\"dMO par CB\",IF(X147=V147,\"dMO par ADF\",\"dMO reg LV99\"))","v":"dMO par CB"},"",{"$f":"IF($C$66=\"GR\",Z147,0)","v":0},"GR",null,null,"",{"$f":"IF($C$66=\"GR\",AE147,0)","v":0},"",{"$f":"IF($C$66=\"GR\",AG147,0)","v":0},"",{"$f":"IF($C$66=\"GR\",AI147,0)","v":0}]
[null,"vert","E ",0,0,0,0,1000,{"$f":"IF(E148=0,\"\", 1.0238*E148 + 29.95)","v":""},{"$f":"IF(E148=0,\"\", 1.7735*E148 + 20.628)","v":""},{"$f":"IF(E148=0,\"\", -0.0027*E148^2 + 1.2332*E148 - 27.716)","v":""},{"$f":"IF(G148=\"\",J148,G148)","v":0},0,0,{"$error":"#DIV/0!"},{"$error":"#DIV/0!"},{"$error":"#DIV/0!"},{"$error":"#DIV/0!"},{"$error":"#DIV/0!"},{"$error":"#DIV/0!"},{"$f":"IF(E148=0,\"\",40.6+0.1599*O148+0.1431*P148-0.000248*R148-0.000351*S148)","v":""},{"$f":"IF(M148=0,\"\",32.3+0.1599*O148+0.1866*Q148-0.000248*R148-0.000382*T148)","v":""},{"$f":"IF(V144=0,\"\",83.5+0.0114*O148-0.000145*S148)","v":{"$error":"#DIV/0!"}},"","dMO par CB","",{"$f":"IF($C$66=\"E\",Z148,0)","v":0},"E ",null,null,"",{"$f":"IF($C$66=\"E\",AE148,0)","v":0},"",{"$f":"IF($C$66=\"E\",AG148,0)","v":0},"",{"$f":"IF($C$66=\"E\",AI148,0)","v":0}]
[null,"vert","ER ",0,0,0,0,1000,{"$f":"IF(E149=0,\"\", 1.0747*E149 + 18.157)","v":""},{"$f":" IF(E149=0,\"\",1.9227*E149 - 15.022)","v":""},{"$f":"IF(E149=0,\"\", 0.0008*E149^2 - 0.4282*E149 + 201.3)","v":""},0,0,0,{"$error":"#DIV/0!"},{"$error":"#DIV/0!"},{"$error":"#DIV/0!"},{"$error":"#DIV/0!"},{"$error":"#DIV/0!"},{"$error":"#DIV/0!"},{"$f":"IF(E149=0,\"\",43.2+0.0859*O149+0.2559*P149-0.000132*R149-0.000678*S149)","v":""},{"$f":"IF(M149=0,\"\",34.4+0.0863*O149+0.2914*Q149-0.000133*R149-0.000647*T149)","v":""},{"$f":"IF(V144=0,\"\",94.4+0.0011*O149-0.0466*P149-0.000075*S149)","v":{"$error":"#DIV/0!"}},"","dMO par CB","",{"$f":"IF($C$66=\"ER\",Z149,0)","v":0},"ER ",null,null,"",{"$f":"IF($C$66=\"ER\",AE149,0)","v":0},"",{"$f":"IF($C$66=\"ER\",AG149,0)","v":0},"",{"$f":"IF($C$66=\"ER\",AI149,0)","v":0}]
[null,"vert","L ",0,0,0,0,1000,{"$f":"IF(E150=0,\"\", 1.0964*E150 + 22.686)","v":""},{"$f":"IF(E150=0,\"\", 1.5566*E150 + 34.674)","v":""},{"$f":"IF(E150=0,\"\", -0.0013*E150^2 + 0.666*E150 + 36.244)","v":""},0,0,0,{"$error":"#DIV/0!"},{"$error":"#DIV/0!"},{"$error":"#DIV/0!"},{"$error":"#DIV/0!"},{"$error":"#DIV/0!"},{"$error":"#DIV/0!"},{"$f":"IF(E150=0,\"\",86-0.000231*S150)","v":""},{"$f":"IF(M150=0,\"\",87.4-0.000179*T150)","v":""},{"$f":"IF(V144=0,\"\",72.6+0.0035*O150+0.1206*P150-0.000435*S150)","v":{"$error":"#DIV/0!"}},"","dMO par CB","",{"$f":"IF($C$66=\"L\",Z150,0)","v":0},"L ",null,null,"",{"$f":"IF($C$66=\"L\",AE150,0)","v":0},"",{"$f":"IF($C$66=\"L\",AG150,0)","v":0},"",{"$f":"IF($C$66=\"L\",AI150,0)","v":0}]
[null,"vert","DF ",0,0,0,0,1000,{"$f":"IF(E151=0,\"\", 1.1167*E151 + 24.749)","v":""},{"$f":"IF(E151=0,\"\", 1.9332*E151 - 31.121)","v":""},{"$f":"IF(E151=0,\"\", 0.0035*E151^2 - 1.3962*E151 + 265.53)","v":""},0,0,0,{"$error":"#DIV/0!"},{"$error":"#DIV/0!"},{"$error":"#DIV/0!"},{"$error":"#DIV/0!"},{"$error":"#DIV/0!"},{"$error":"#DIV/0!"},{"$f":"IF(E151=0,\"\",58.9+0.0792*O151+0.132*P151-0.000121*R151-0.000428*S151)","v":""},{"$f":"IF(M151=0,\"\",48.6+0.0779*O151+0.2008*Q151-0.000118*R151-0.000487*T151)","v":""},{"$f":"IF(V144=0,\"\",174.6-0.1409*O151-0.4803*P151+0.000543*S151)","v":{"$error":"#DIV/0!"}},"","dMO par CB","",{"$f":"IF($C$66=\"DF\",Z151,0)","v":0},"DF ",null,null,"",{"$f":"IF($C$66=\"DF\",AE151,0)","v":0},"",{"$f":"IF($C$66=\"DF\",AG151,0)","v":0},"",{"$f":"IF($C$66=\"DF\",AI151,0)","v":0}]
[null,"vert","DT ",0,0,0,0,1000,{"$f":"IF(E152=0,\"\", 1.1896*E152 + 14.282)","v":""},{"$f":"IF(E152=0,\"\", 1.9337*E152 - 32.211)","v":""},{"$f":"IF(E152=0,\"\", 0.0011*E152^2 - 0.6024*E152 + 209.31)","v":""},0,0,0,{"$error":"#DIV/0!"},{"$error":"#DIV/0!"},{"$error":"#DIV/0!"},{"$error":"#DIV/0!"},{"$error":"#DIV/0!"},{"$error":"#DIV/0!"},{"$f":"IF(E152=0,\"\",43.6+0.1806*O152+0.1384*P152-0.000298*R152-0.000475*S152)","v":""},{"$f":"IF(M152=0,\"\",35.2+0.1813*O152+0.1512*Q152-0.000299*R152-0.000311*T152)","v":""},{"$f":"IF(V144=0,\"\",174.6-0.1409*O152-0.4803*P152+0.000543*S152)","v":{"$error":"#DIV/0!"}},"","dMO par CB","",{"$f":"IF($C$66=\"DT\",Z152,0)","v":0},"DT ",null,null,"",{"$f":"IF($C$66=\"DT\",AE152,0)","v":0},"",{"$f":"IF($C$66=\"DT\",AG152,0)","v":0},"",{"$f":"IF($C$66=\"DT\",AI152,0)","v":0}]
[null,"vert","IND ",0,0,0,0,1000,{"$f":"IF(E153=0,\"\", 0.9296*E153 + 55.229)","v":""},{"$f":"IF(E153=0,\"\", 1.8457*E153 - 10.667)","v":""},{"$f":"IF(E153=0,\"\", -0.0074*E153^2 + 3.2716*E153 - 221.76)","v":""},0,0,0,{"$error":"#DIV/0!"},{"$error":"#DIV/0!"},{"$error":"#DIV/0!"},{"$error":"#DIV/0!"},{"$error":"#DIV/0!"},{"$error":"#DIV/0!"},{"$f":"IF(E153=0,\"\",56.7+0.1262*O153+0.0939*P153-0.000231*R153-0.000312*S153)","v":""},{"$f":"IF(M153=0,\"\",54.8+0.1121*O153+0.1221*Q153-0.000207*R153-0.000335*T153)","v":""},{"$f":"IF(V144=0,\"\",72.7+0.0291*O153+0.0481*P153-0.000211*S153)","v":{"$error":"#DIV/0!"}},"","dMO par CB","",{"$f":"IF($C$66=\"INC\",Z153,0)","v":0},"IND ",null,null,"",{"$f":"IF($C$66=\"INC\",AE153,0)","v":0},"",{"$f":"IF($C$66=\"INC\",AG153,0)","v":0},"",{"$f":"IF($C$66=\"INC\",AI153,0)","v":0}]
[null,"vert","dg",0,0,0,0,1000,{"$f":"IF(E154=0,\"\", 0.9853*E154 + 28.437)","v":""},{"$f":"IF(E154=0,\"\", 1.3785*E154 + 156.77)","v":""},{"$f":"IF(E154=0,\"\", -0.0086*E154^2 + 5.0791*E154 - 639.52)","v":""},0,0,0,{"$error":"#DIV/0!"},{"$error":"#DIV/0!"},{"$error":"#DIV/0!"},{"$error":"#DIV/0!"},{"$error":"#DIV/0!"},{"$error":"#DIV/0!"},{"$f":"IF(E154=0,\"\",93.6-0.000221*S154)","v":""},{"$f":"IF(M154=0,\"\",96.3-0.000212*T154)","v":""},null,"","dMO par CB","",{"$f":"IF($C$66=\"dg\",Z154,0)","v":0},"dg",null,null,"",{"$f":"IF($C$66=\"dg\",AE154,0)","v":0},"",{"$f":"IF($C$66=\"dg\",AG154,0)","v":0},"",{"$f":"IF($C$66=\"dg\",AI154,0)","v":0}]
[null,"vert","lp",0,0,0,0,1000,{"$f":"IF(E155=0,\"\", 2.106*E155 - 35.434)","v":""},{"$f":"IF(E155=0,\"\", 1.1817*E155 - 20.908)","v":""},{"$f":"IF(E155=0,\"\", 0.0136*E155^2 - 7.0911*E155 + 1098.3)","v":""},0,0,0,{"$error":"#DIV/0!"},{"$error":"#DIV/0!"},{"$error":"#DIV/0!"},{"$error":"#DIV/0!"},{"$error":"#DIV/0!"},{"$error":"#DIV/0!"},{"$f":"IF(E155=0,\"\",95.5+0.0122*O155-0.000316*S155)","v":""},{"$f":"IF(M155=0,\"\",98.3+0.0013*O155-0.000279*T155)","v":""},{"$f":"IF(W144=0,\"\",74.4+0.0085*O155+0.1103*P155-0.000411*S155)","v":""},"","dMO par CB","",{"$f":"IF($C$66=\"lp\",Z155,0)","v":0},"lp",{"$f":"IF($J$60=3,W161,0)","v":0},"dMOmaïs LV99","",{"$f":"IF($C$66=\"lp\",AE155,0)","v":0},"",{"$f":"IF($C$66=\"lp\",AG155,0)","v":0},"",{"$f":"IF($C$66=\"lp\",AI155,0)","v":0}]
[null,"vert","li",0,0,0,0,1000,{"$f":"IF(E156=0,\"\", 1.2035*E156 - 16.67)","v":""},{"$f":"IF(E156=0,\"\", 1.7517*E156 + 47.237)","v":""},{"$f":"IF(E156=0,\"\", -0.001*E156^2 + 0.3864*E156 + 171.38)","v":""},0,0,0,{"$error":"#DIV/0!"},{"$error":"#DIV/0!"},{"$error":"#DIV/0!"},{"$error":"#DIV/0!"},{"$error":"#DIV/0!"},{"$error":"#DIV/0!"},{"$f":"IF(E156=0,\"\",101.7-0.000446*S156)","v":""},{"$f":"IF(M156=0,\"\",101.1-0.000339*T156)","v":""},{"$f":"IF(V144=0,\"\",74.4+0.0085*O156+0.1103*P156-0.000411*S156)","v":{"$error":"#DIV/0!"}},"","dMO par CB","",{"$f":"IF($C$66=\"li\",Z156,0)","v":0},"li",{"$f":"IF(AND($A$84=4,$J$60=1),U161,0)","v":0},"dMOmaïs LV06 par CB (INRA)","",{"$f":"IF($C$66=\"li\",AE156,0)","v":0},"",{"$f":"IF($C$66=\"li\",AG156,0)","v":0},"",{"$f":"IF($C$66=\"li\",AI156,0)","v":0}]
[null,"vert","ap",0,0,0,0,1000,{"$f":"IF(E157=0,\"\", 1.2025*E157 - 25.099)","v":""},{"$f":"IF(E157=0,\"\", 2.1605*E157 - 53.052)","v":""},{"$f":"IF(E157=0,\"\", 0.0044*E157^2 - 2.8995*E157 + 547.51)","v":""},0,0,0,{"$error":"#DIV/0!"},{"$error":"#DIV/0!"},{"$error":"#DIV/0!"},{"$error":"#DIV/0!"},{"$error":"#DIV/0!"},{"$error":"#DIV/0!"},{"$f":"IF(E157=0,\"\",90.1+0.0414*O157-0.000309*S157)","v":""},{"$f":"IF(M157=0,\"\",98.6+0.0144*O157-0.000282*T157)","v":""},null,"","dMO par CB","",{"$f":"IF($C$66=\"ap\",Z157,0)","v":0},"ap",{"$f":"IF(AND($A$84=4,$J$60=2),U161,0)","v":0},"dMO maïs LV06 par ADFNDF (INRA)","",{"$f":"IF($C$66=\"ap\",AE157,0)","v":0},"",{"$f":"IF($C$66=\"ap\",AG157,0)","v":0},"",{"$f":"IF($C$66=\"ap\",AI157,0)","v":0}]
[null,"vert","tr",0,0,0,0,1000,{"$f":"IF(E158=0,\"\", 1.2727*E158 + 8.4545)","v":""},{"$f":"IF(E158=0,\"\", 1.5973*E158 - 9.5709)","v":""},{"$f":"IF(E158=0,\"\", -0.0069*E158^2 + 2.2686*E158 - 100.25)","v":""},0,0,0,{"$error":"#DIV/0!"},{"$error":"#DIV/0!"},{"$error":"#DIV/0!"},{"$error":"#DIV/0!"},{"$error":"#DIV/0!"},{"$error":"#DIV/0!"},{"$f":"IF(E158=0,\"\",58.2+0.0732*O158-0.000022*S158)","v":""},{"$f":"IF(M158=0,\"\",61.7+0.0642*O158-0.00003*T158)","v":""},null,"","dMO par CB","",{"$f":"IF($C$66=\"tr\",Z158,0)","v":0},"tr",{"$f":"IF(AND($A$84=1,$J$60=1),100*((((N161*U161/100)*1.2812)-180.35)/N161),0)","v":{"$error":"#VALUE!"}},"dMOmaïscorr. Par MOD dMOCB: 1.2812 x MOD CB -180.35","",{"$f":"IF($C$66=\"tr\",AE158,0)","v":0},"",{"$f":"IF($C$66=\"tr\",AG158,0)","v":0},"",{"$f":"IF($C$66=\"tr\",AI158,0)","v":0}]
[null,"vert","tp",0,0,0,0,1000,{"$f":"IF(E159=0,\"\", 1.125*E159 + 20.242)","v":""},{"$f":"IF(E159=0,\"\", 1.3119*E159 + 58.139)","v":""},{"$f":"IF(E159=0,\"\", -0.0004*E159^2 + 0.0843*E159 +101.68)","v":""},0,0,0,{"$error":"#DIV/0!"},{"$error":"#DIV/0!"},{"$error":"#DIV/0!"},{"$error":"#DIV/0!"},{"$error":"#DIV/0!"},{"$error":"#DIV/0!"},{"$f":"IF(E159=0,\"\",78.8+0.000047*R159-0.000154*S159)","v":""},{"$f":"IF(M159=0,\"\",80.2+0.000041*R159-0.000118*T159)","v":""},null,"","dMO par CB","",{"$f":"IF($C$66=\"tp\",Z159,0)","v":0},"tp",{"$f":"IF(AND($A$84=1,$J$60=2),100*((((N161*V161/100)*1.2653)-156.12)/N161),0)","v":0},"dMOmaïs corr. Par MOD dMOADF : 1.2653 x MOD ADF - 156.12","",{"$f":"IF($C$66=\"tp\",AE159,0)","v":0},"",{"$f":"IF($C$66=\"tp\",AG159,0)","v":0},"",{"$f":"IF($C$66=\"tp\",AI159,0)","v":0}]
[null,"vert","luz",0,0,0,0,1000,{"$f":" IF(E160=0,\"\",1.0526*E160 + 34.944)","v":""},{"$f":"IF(E160=0,\"\", 1.2979*E160 + 32.529)","v":""},{"$f":"IF(E160=0,\"\", -0.00004*E160^2 - 0.0411*E160 + 71.168)","v":""},0,0,0,{"$error":"#DIV/0!"},{"$error":"#DIV/0!"},{"$error":"#DIV/0!"},{"$error":"#DIV/0!"},{"$error":"#DIV/0!"},{"$error":"#DIV/0!"},{"$f":"IF(E160=0,\"\",52.4+0.0898*O160-0.000062*S160)","v":""},{"$f":"IF(M160=0,\"\",56.7+0.0796*O160-0.00006*T160)","v":""},{"$f":"IF(V144=0,\"\",100.1-0.0989*P160)","v":{"$error":"#DIV/0!"}},"","dMO par CB","",{"$f":"IF($C$66=\"LUZ\",Z160,0)","v":0},"luz",{"$f":"IF(AND($A$84=2,$J$60<3),100*((-1016.7+($J$115*1.8)+(($J$109*$J$117/1000)*1.106)+(($M$109*$M$115/1000)*(-3.01))+(($M$110*$M$111/1000)*(-0.0013))+10.3)/$J$115),0)","v":0},"dMOmaïs PE équation ALP12","",{"$f":"IF($C$66=\"LUZ\",AE160,0)","v":0},"",{"$f":"IF($C$66=\"LUZ\",AG160,0)","v":0},"",{"$f":"IF($C$66=\"LUZ\",AI160,0)","v":0}]
[null,"vert","maïs",0,0,0,0,1000,{"$f":"IF(E161=0,\"\", 1.0966*E161 + 16.236)","v":""},{"$f":"IF(E161=0,\"\",1.5282*E161 + 125.25)","v":""},{"$f":"IF(E161=0,\"\", 0.2348*E161 + 4.8502)","v":""},0,0,0,{"$error":"#DIV/0!"},{"$error":"#DIV/0!"},{"$error":"#DIV/0!"},{"$error":"#DIV/0!"},{"$error":"#DIV/0!"},{"$error":"#DIV/0!"},{"$f":"IF(E161=0,\"\",79.4+0.0652*O161-0.0591*P161)","v":""},{"$f":"IF(M161=0,\"\",IF(L161=0,\"\",75.7+0.0701*O161+0.0156*L161/N161*1000-0.072*Q161))","v":""},{"$f":"IF(V144=0,\"\",82.5+0.0758*O161-0.0729*P161)","v":{"$error":"#DIV/0!"}},"","dMO par CB","",{"$f":"IF(Z161=\"\",\"\",IF($C$66=\"MAÏS\",SUM(AC155:AC161),0))","v":""},"maïs",{"$f":"IF(AND($A$84=3,$J$60<3),100*((-1016.7+($J$115*1.8)+(($J$109*$J$117/1000)*1.106)+(($M$109*$M$115/1000)*(-3.01))+(($M$110*$M$111/1000)*(-0.0013))-10.3)/$J$115),0)","v":0},"dMOmaïs pas PE équation ALP12",{"$f":"IF($C$60=\"VER\",I161,\"\")","v":""},{"$f":"IF($C$66=\"MAÏS\",AE161,0)","v":0},"",{"$f":"IF($C$66=\"MAÏS\",AG161,0)","v":0},"",{"$f":"IF($C$66=\"MAÏS\",AI161,0)","v":0}]
[null,"ensilé","G",0,0,0,0,1000,{"$f":"IF(E162=0,\"\", 0.9982*E162 + 38.072)","v":""},{"$f":"IF(E162=0,\"\", 1.5508*E162 + 35.621)","v":""},{"$f":"IF(E162=0,\"\", -0.0017*E162^2 + 0.9258*E162 - 84.881)","v":""},0,0,0,{"$error":"#DIV/0!"},{"$error":"#DIV/0!"},{"$error":"#DIV/0!"},{"$error":"#DIV/0!"},{"$error":"#DIV/0!"},{"$error":"#DIV/0!"},{"$f":"IF(E162=0,\"\",26.3+0.1653*O162+0.2041*P162-0.000241*R162-0.000419*S162)","v":""},{"$f":"IF(M162=0,\"\",10.8+0.1652*O162+0.2793*Q162-0.00024*R162-0.000484*T162)","v":""},{"$f":"IF(V144=0,\"\",110.8-0.000032*R162-0.1298*P162)","v":{"$error":"#DIV/0!"}},"","dMO par CB",{"$f":"IF($C$60=\"ENS\",X162,\"\")","v":""},{"$f":"IF($C$66=\"G\",Z162,0)","v":""},"G",null,null,{"$f":"IF($C$60=\"ENS\",I162,\"\")","v":""},{"$f":"IF($C$66=\"G\",AE162,0)","v":""},{"$f":"IF($C$60=\"ENS\",J162,\"\")","v":""},{"$f":"IF($C$66=\"G\",AG162,0)","v":""},{"$f":"IF($C$60=\"ENS\",K162,\"\")","v":""},{"$f":"IF($C$66=\"G\",AI162,0)","v":""}]
[null,"ensilé","GR",0,0,0,0,1000,{"$f":"IF(E163=0,\"\", 1.0241*E163 + 30.808)","v":""},{"$f":"IF(E163=0,\"\", 1.7027*E163 - 6.0565)","v":""},{"$f":" IF(E163=0,\"\",0.0017*E163^2 - 0.8951*E163 + 178.35)","v":""},0,0,0,{"$error":"#DIV/0!"},{"$error":"#DIV/0!"},{"$error":"#DIV/0!"},{"$error":"#DIV/0!"},{"$error":"#DIV/0!"},{"$error":"#DIV/0!"},{"$f":"IF(E163=0,\"\",10.4+0.1206*O163+0.4102*P163-0.000174*R163-0.000849*S163)","v":""},{"$f":"IF(M163=0,\"\",-9.4+0.1206*O163+0.4916*Q163-0.000174*R163-0.000872*T163)","v":""},{"$f":"IF(V144=0,\"\",94.1-0.0067*O163-0.0262*P163-0.000141*S163)","v":{"$error":"#DIV/0!"}},"","dMO par CB",{"$f":"IF($C$60=\"ENS\",X163,\"\")","v":""},{"$f":"IF($C$66=\"GR\",Z163,0)","v":0},"GR",null,null,"",{"$f":"IF($C$66=\"GR\",AE163,0)","v":0},"",{"$f":"IF($C$66=\"GR\",AG163,0)","v":0},"",{"$f":"IF($C$66=\"GR\",AI163,0)","v":0}]
[null,"ensilé","E ",0,0,0,0,1000,{"$f":"IF(E164=0,\"\", 1.0005*E164 + 42.48)","v":""},{"$f":"IF(E164=0,\"\", 1.6001*E164 + 10.376)","v":""},{"$f":"IF(E164=0,\"\", -0.0005*E164^2 + 0.2288*E164 +16.541)","v":""},0,0,0,{"$error":"#DIV/0!"},{"$error":"#DIV/0!"},{"$error":"#DIV/0!"},{"$error":"#DIV/0!"},{"$error":"#DIV/0!"},{"$error":"#DIV/0!"},{"$f":"IF(E164=0,\"\",34.1+0.1596*O164+0.1653*P164-0.000233*R164-0.000376*S164)","v":""},{"$f":"IF(M164=0,\"\",19.4+0.1596*O164+0.2424*Q164-0.000232*R164-0.000447*T164)","v":""},{"$f":"IF(V144=0,\"\",122.1-0.0423*O164-0.1478*P164)","v":{"$error":"#DIV/0!"}},"","dMO par CB","",{"$f":"IF($C$66=\"E\",Z164,0)","v":0},"E ",null,null,"",{"$f":"IF($C$66=\"E\",AE164,0)","v":0},"",{"$f":"IF($C$66=\"E\",AG164,0)","v":0},"",{"$f":"IF($C$66=\"E\",AI164,0)","v":0}]
[null,"ensilé","ER ",0,0,0,0,1000,{"$f":"IF(E165=0,\"\", 1.026*E165 + 35.952)","v":""},{"$f":"IF(E165=0,\"\", 1.7144*E165 - 17.949)","v":""},{"$f":"IF(E165=0,\"\", 0.0001*E165^2 - 0.081*E165 + 68.852)","v":""},0,0,0,{"$error":"#DIV/0!"},{"$error":"#DIV/0!"},{"$error":"#DIV/0!"},{"$error":"#DIV/0!"},{"$error":"#DIV/0!"},{"$error":"#DIV/0!"},{"$f":"IF(E165=0,\"\",34.9+0.0857*O165+0.2967*P165-0.000124*R165-0.000724*S165)","v":""},{"$f":"IF(M165=0,\"\",16.9+0.0864*O165+0.3815*Q165-0.000125*R165-0.000755*T165)","v":""},{"$f":"IF(V144=0,\"\",95.4-0.0002*O165-0.0513*P165-0.000068*S165)","v":{"$error":"#DIV/0!"}},"","dMO par CB","",{"$f":"IF($C$66=\"ER\",Z165,0)","v":0},"ER ",null,null,"",{"$f":"IF($C$66=\"ER\",AE165,0)","v":0},"",{"$f":"IF($C$66=\"ER\",AG165,0)","v":0},"",{"$f":"IF($C$66=\"ER\",AI165,0)","v":0}]
[null,"ensilé","L ",0,0,0,0,1000,{"$f":"IF(E166=0,\"\", 1.0405*E166 + 41.457)","v":""},{"$f":"IF(E166=0,\"\", 1.369*E166 + 34.55)","v":""},{"$f":"IF(E166=0,\"\", 0.00003*E166^2 -0.051*E166 + 53.265)","v":""},0,0,0,{"$error":"#DIV/0!"},{"$error":"#DIV/0!"},{"$error":"#DIV/0!"},{"$error":"#DIV/0!"},{"$error":"#DIV/0!"},{"$error":"#DIV/0!"},{"$f":"IF(E166=0,\"\",85.8-0.000229*S166)","v":""},{"$f":"IF(M166=0,\"\",88.3-0.000181*T166)","v":""},{"$f":"IF(V144=0,\"\",70.4+0.0086*O166+0.1247*P166-0.000436*S166)","v":{"$error":"#DIV/0!"}},"","dMO par CB","",{"$f":"IF($C$66=\"L\",Z166,0)","v":0},"L ",null,null,"",{"$f":"IF($C$66=\"L\",AE166,0)","v":0},"",{"$f":"IF($C$66=\"L\",AG166,0)","v":0},"",{"$f":"IF($C$66=\"L\",AI166,0)","v":0}]
[null,"ensilé","DF ",0,0,0,0,1000,{"$f":"IF(E167=0,\"\",1.0842*E167 + 38.447)","v":""},{"$f":"IF(E167=0,\"\", 1.7333*E167 - 34.721)","v":""},{"$f":"IF(E167=0,\"\", 0.0015*E167^2 - 0.6373*E167 + 114.42)","v":""},0,0,0,{"$error":"#DIV/0!"},{"$error":"#DIV/0!"},{"$error":"#DIV/0!"},{"$error":"#DIV/0!"},{"$error":"#DIV/0!"},{"$error":"#DIV/0!"},{"$f":"IF(E167=0,\"\",54+0.078*O167+0.1557*P167-0.000111*R167-0.000457*S167)","v":""},{"$f":"IF(M167=0,\"\",36.1+0.0759*O167+0.268*Q167-0.000107*R167-0.000572*T167)","v":""},{"$f":"IF(V144=0,\"\",122.4-0.0213*O167-0.2763*P167+0.000294*S167)","v":{"$error":"#DIV/0!"}},"","dMO par CB","",{"$f":"IF($C$66=\"DF\",Z167,0)","v":0},"DF ",null,null,"",{"$f":"IF($C$66=\"DF\",AE167,0)","v":0},"",{"$f":"IF($C$66=\"DF\",AG167,0)","v":0},"",{"$f":"IF($C$66=\"DF\",AI167,0)","v":0}]
[null,"ensilé","DT ",0,0,0,0,1000,{"$f":"IF(E168=0,\"\", 1.1428*E168 + 29.545)","v":""},{"$f":"IF(E168=0,\"\", 1.7401*E168 - 37.006)","v":""},{"$f":"IF(E168=0,\"\", 0.0008*E168^2 - 0.3693*E168 + 94.79)","v":""},0,0,0,{"$error":"#DIV/0!"},{"$error":"#DIV/0!"},{"$error":"#DIV/0!"},{"$error":"#DIV/0!"},{"$error":"#DIV/0!"},{"$error":"#DIV/0!"},{"$f":"IF(E168=0,\"\",37.4+0.1809*O168+0.1622*P168-0.00028*R168-0.0005*S168)","v":""},{"$f":"IF(M168=0,\"\",24.2+0.1819*O168+0.1929*Q168-0.000282*R168-0.000355*T168)","v":""},{"$f":"IF(V144=0,\"\",122.4-0.0213*O168-0.2763*P168+0.000294*S168)","v":{"$error":"#DIV/0!"}},"","dMO par CB","",{"$f":"IF($C$66=\"DT\",Z168,0)","v":0},"DT ",null,null,"",{"$f":"IF($C$66=\"DT\",AE168,0)","v":0},"",{"$f":"IF($C$66=\"DT\",AG168,0)","v":0},"",{"$f":"IF($C$66=\"DT\",AI168,0)","v":0}]
[null,"ensilé","IND ",0,0,0,0,1000,{"$f":"IF(E169=0,\"\", 0.8941*E169 + 68.218)","v":""},{"$f":"IF(E169=0,\"\", 1.6092*E169 + 18.402)","v":""},{"$f":"IF(E169=0,\"\", -0.0031*E169^2 + 1.4524*E169 - 117.39)","v":""},0,0,0,{"$error":"#DIV/0!"},{"$error":"#DIV/0!"},{"$error":"#DIV/0!"},{"$error":"#DIV/0!"},{"$error":"#DIV/0!"},{"$error":"#DIV/0!"},{"$f":"IF(E169=0,\"\",51.8+0.1275*O169+0.1116*P169-0.000219*R169-0.000333*S169)","v":""},{"$f":"IF(M169=0,\"\",45.7+0.1145*O169+0.1661*Q169-0.000199*R169-0.00039*T169)","v":""},{"$f":"IF(V144=0,\"\",61.6+0.0386*O169+0.0965*P169-0.000274*S169)","v":{"$error":"#DIV/0!"}},"","dMO par CB","",{"$f":"IF($C$66=\"INC\",Z169,0)","v":0},"IND ",null,null,"",{"$f":"IF($C$66=\"INC\",AE169,0)","v":0},"",{"$f":"IF($C$66=\"INC\",AG169,0)","v":0},"",{"$f":"IF($C$66=\"INC\",AI169,0)","v":0}]
[null,"ensilé","dg",0,0,0,0,1000,{"$f":"IF(E170=0,\"\", 0.9309*E170 + 50.049)","v":""},{"$f":"IF(E170=0,\"\", 1.2196*E170 + 143.54)","v":""},{"$f":"IF(E170=0,\"\", 0.0004*E170^2 -0.2612*E170 +82.006)","v":""},0,0,0,{"$error":"#DIV/0!"},{"$error":"#DIV/0!"},{"$error":"#DIV/0!"},{"$error":"#DIV/0!"},{"$error":"#DIV/0!"},{"$error":"#DIV/0!"},{"$f":"IF(E170=0,\"\",94.5-0.000225*S170)","v":""},{"$f":"IF(M170=0,\"\",99.2-0.000224*T170)","v":""},null,"","dMO par CB","",{"$f":"IF($C$66=\"dg\",Z170,0)","v":0},"dg",null,null,"",{"$f":"IF($C$66=\"dg\",AE170,0)","v":0},"",{"$f":"IF($C$66=\"dg\",AG170,0)","v":0},"",{"$f":"IF($C$66=\"dg\",AI170,0)","v":0}]
[null,"ensilé","lp",0,0,0,0,1000,{"$f":"IF(E171=0,\"\", 1.122*E171 - 0.7226)","v":""},{"$f":"IF(E171=0,\"\", 1.8755*E171 - 38.083)","v":""},{"$f":"IF(E171=0,\"\", 0.0064*E171^2 - 3.4633*E171 + 538.08)","v":""},0,0,0,{"$error":"#DIV/0!"},{"$error":"#DIV/0!"},{"$error":"#DIV/0!"},{"$error":"#DIV/0!"},{"$error":"#DIV/0!"},{"$error":"#DIV/0!"},{"$f":"IF(E171=0,\"\",101.5-0.000352*S171)","v":""},{"$f":"IF(M171=0,\"\",102.2-0.000293*T171)","v":""},{"$f":"IF(V144=0,\"\",109.7-0.0205*O171-0.0766*P171-0.000151*S171)","v":{"$error":"#DIV/0!"}},"","dMO par CB","",{"$f":"IF($C$66=\"lp\",Z171,0)","v":0},"lp",{"$f":"IF($J$60=3,W177,0)","v":0},"dMOmaïs LV99","",{"$f":"IF($C$66=\"lp\",AE171,0)","v":0},"",{"$f":"IF($C$66=\"lp\",AG171,0)","v":0},"",{"$f":"IF($C$66=\"lp\",AI171,0)","v":0}]
[null,"ensilé","li",0,0,0,0,1000,{"$f":"IF(E172=0,\"\", 1.1351*E172 + 4.7669)","v":""},{"$f":"IF(E172=0,\"\", 1.5509*E172 + 41.592)","v":""},{"$f":"IF(E172=0,\"\", -0.0005*E172^2 + 0.1982*E172 + 62.47)","v":""},0,0,0,{"$error":"#DIV/0!"},{"$error":"#DIV/0!"},{"$error":"#DIV/0!"},{"$error":"#DIV/0!"},{"$error":"#DIV/0!"},{"$error":"#DIV/0!"},{"$f":"IF(E172=0,\"\",103.8-0.000449*S172)","v":""},{"$f":"IF(M172=0,\"\",104.1-0.000341*T172)","v":""},{"$f":"IF(V144=0,\"\",109.7-0.0205*O172-0.0766*P172-0.000151*S172)","v":{"$error":"#DIV/0!"}},"","dMO par CB","",{"$f":"IF($C$66=\"li\",Z172,0)","v":0},"li",{"$f":"IF(AND($A$84=4,$J$60=1),U177,0)","v":0},"dMOmaïs LV06 par CB (INRA)","",{"$f":"IF($C$66=\"li\",AE172,0)","v":0},"",{"$f":"IF($C$66=\"li\",AG172,0)","v":0},"",{"$f":"IF($C$66=\"li\",AI172,0)","v":0}]
[null,"ensilé","ap",0,0,0,0,1000,{"$f":"IF(E173=0,\"\", 1.1742*E173 - 13.802)","v":""},{"$f":"IF(E173=0,\"\", 1.9325*E173 - 56.89)","v":""},{"$f":"IF(E173=0,\"\", 0.0016*E173^2 - 1.119*E173 + 218.21)","v":""},0,0,0,{"$error":"#DIV/0!"},{"$error":"#DIV/0!"},{"$error":"#DIV/0!"},{"$error":"#DIV/0!"},{"$error":"#DIV/0!"},{"$error":"#DIV/0!"},{"$f":"IF(E173=0,\"\",86.1+0.0573*O173-0.000291*S173)","v":""},{"$f":"IF(M173=0,\"\",101.8+0.0173*O173-0.000293*T173)","v":""},null,"","dMO par CB","",{"$f":"IF($C$66=\"ap\",Z173,0)","v":0},"ap",{"$f":"IF(AND($A$84=4,$J$60=2),U177,0)","v":0},"dMO maïs LV06 par ADFNDF (INRA)","",{"$f":"IF($C$66=\"ap\",AE173,0)","v":0},"",{"$f":"IF($C$66=\"ap\",AG173,0)","v":0},"",{"$f":"IF($C$66=\"ap\",AI173,0)","v":0}]
[null,"ensilé","tr",0,0,0,0,1000,{"$f":"IF(E174=0,\"\", 1.2468*E174 + 18.486)","v":""},{"$f":"IF(E174=0,\"\", 1.4135*E174 - 7.8475)","v":""},{"$f":"IF(E174=0,\"\", -0.0035*E174^2 + 1.2495*E174 - 80.005)","v":""},0,0,0,{"$error":"#DIV/0!"},{"$error":"#DIV/0!"},{"$error":"#DIV/0!"},{"$error":"#DIV/0!"},{"$error":"#DIV/0!"},{"$error":"#DIV/0!"},{"$f":"IF(E174=0,\"\",86.5-0.000261*S174)","v":""},{"$f":"IF(M174=0,\"\",87.1-0.000152*T174)","v":""},null,"","dMO par CB","",{"$f":"IF($C$66=\"tr\",Z174,0)","v":0},"tr",{"$f":"IF(AND($A$84=1,$J$60=1),100*((((N177*U177/100)*1.2812)-180.35)/N177),0)","v":{"$error":"#VALUE!"}},"dMOmaïscorr. Par MOD dMOCB: 1.2812 x MOD CB -180.35","",{"$f":"IF($C$66=\"tr\",AE174,0)","v":0},"",{"$f":"IF($C$66=\"tr\",AG174,0)","v":0},"",{"$f":"IF($C$66=\"tr\",AI174,0)","v":0}]
[null,"ensilé","tp",0,0,0,0,1000,{"$f":"IF(E175=0,\"\", 1.0699*E175 + 38.695)","v":""},{"$f":"IF(E175=0,\"\", 1.1597*E175 + 56.057)","v":""},{"$f":"IF(E175=0,\"\", -0.0001*E175^2 + 0.0244*E175 +37.2)","v":""},0,0,0,{"$error":"#DIV/0!"},{"$error":"#DIV/0!"},{"$error":"#DIV/0!"},{"$error":"#DIV/0!"},{"$error":"#DIV/0!"},{"$error":"#DIV/0!"},{"$f":"IF(E175=0,\"\",82.5-0.000189*S175)","v":""},{"$f":"IF(M175=0,\"\",84.1-0.000141*T175)","v":""},null,"","dMO par CB","",{"$f":"IF($C$66=\"tp\",Z175,0)","v":0},"tp",{"$f":"IF(AND($A$84=1,$J$60=2),100*((((N177*V177/100)*1.2653)-156.12)/N177),0)","v":0},"dMOmaïs corr. Par MOD dMOADF : 1.2653 x MOD ADF - 156.12","",{"$f":"IF($C$66=\"tp\",AE175,0)","v":0},"",{"$f":"IF($C$66=\"tp\",AG175,0)","v":0},"",{"$f":"IF($C$66=\"tp\",AI175,0)","v":0}]
[null,"ensilé","luz",0,0,0,0,1000,{"$f":"IF(E176=0,\"\", 1.0188*E176 + 49.137)","v":""},{"$f":"IF(E176=0,\"\", 1.1564*E176 + 31.521)","v":""},{"$f":"IF(E176=0,\"\", 0.00002*E176^2 - 0.0342*E176 + 25.721)","v":""},0,0,0,{"$error":"#DIV/0!"},{"$error":"#DIV/0!"},{"$error":"#DIV/0!"},{"$error":"#DIV/0!"},{"$error":"#DIV/0!"},{"$error":"#DIV/0!"},{"$f":"IF(E176=0,\"\",72.3+0.0249*O176-0.000128*S176)","v":""},{"$f":"IF(M176=0,\"\",65.3+0.0517*O176-0.000088*T176)","v":""},{"$f":"IF(V144=0,\"\",80.5+0.0133*O176-0.0051*P176-0.000135*S176)","v":{"$error":"#DIV/0!"}},"","dMO par CB","",{"$f":"IF($C$66=\"LUZ\",Z176,0)","v":0},"luz",{"$f":"IF(AND($A$84=2,$J$60<3),100*((-1016.7+($J$115*1.8)+(($J$109*$J$117/1000)*1.106)+(($M$109*$M$115/1000)*(-3.01))+(($M$110*$M$111/1000)*(-0.0013))+10.3)/$J$115),0)","v":0},"dMOmaïs PE équation ALP12","",{"$f":"IF($C$66=\"LUZ\",AE176,0)","v":0},"",{"$f":"IF($C$66=\"LUZ\",AG176,0)","v":0},"",{"$f":"IF($C$66=\"LUZ\",AI176,0)","v":0}]
[null,"ensilé","maïs",0,0,0,0,1000,{"$f":"IF(E177=0,\"\",1.1218*E177 + 6.4254)","v":""},{"$f":"IF(E177=0,\"\", 1.4325*E177 + 157.81)","v":""},{"$f":"IF(E177=0,\"\", -0.0003*E177^2 +0.1992*E177 -14.604)","v":""},0,0,0,{"$error":"#DIV/0!"},{"$error":"#DIV/0!"},{"$error":"#DIV/0!"},{"$error":"#DIV/0!"},{"$error":"#DIV/0!"},{"$error":"#DIV/0!"},{"$f":"IF(E177=0,\"\",79.4+0.0652*O177-0.0591*P177)","v":""},{"$f":"IF(M177=0,\"\",IF(L177=0,\"\",75.7+0.0701*O177+0.0156*L177/N177*1000-0.072*Q177))","v":""},{"$f":"IF(V144=0,\"\",97.6-0.1711*P177+0.00028*S177)","v":{"$error":"#DIV/0!"}},"","dMO par CB","",{"$f":"IF(Z177=\"\",\"\",IF($C$66=\"MAÏS\",SUM(AC171:AC177),0))","v":""},"maïs",{"$f":"IF(AND($A$84=3,$J$60<3),100*((-1016.7+($J$115*1.8)+(($J$109*$J$117/1000)*1.106)+(($M$109*$M$115/1000)*(-3.01))+(($M$110*$M$111/1000)*(-0.0013))-10.3)/$J$115),0)","v":0},"dMOmaïs pas PE équation ALP12",{"$f":"IF($C$60=\"ENS\",I177,\"\")","v":""},{"$f":"IF($C$66=\"MAÏS\",AE177,0)","v":0},"",{"$f":"IF($C$66=\"MAÏS\",AG177,0)","v":0},"",{"$f":"IF($C$66=\"MAÏS\",AI177,0)","v":0}]
[null,"séché","G",0,0,0,0,1000,{"$f":"IF(E178=0,\"\", 0.9804*E178 + 36.115)","v":""},{"$f":"IF(E178=0,\"\", 1.577*E178 + 73.373)","v":""},{"$f":"IF(E178=0,\"\", -0.0006*E178^2 + 0.2497*E178 + 60.394)","v":""},0,0,0,{"$error":"#DIV/0!"},{"$error":"#DIV/0!"},{"$error":"#DIV/0!"},{"$error":"#DIV/0!"},{"$error":"#DIV/0!"},{"$error":"#DIV/0!"},{"$f":"IF(E178=0,\"\",28.5+0.1769*O178+0.173*P178-0.000313*R178-0.000351*S178)","v":""},{"$f":"IF(M178=0,\"\",20.4+0.1769*O178+0.209*Q178-0.000312*R178-0.000371*T178)","v":""},{"$f":"IF(V144=0,\"\",116.1-0.000075*R178-0.1976*P178+0.000132*S178)","v":{"$error":"#DIV/0!"}},"","dMO par CB",{"$f":"IF($C$60=\"SEC\",X178,\"\")","v":""},{"$f":"IF($C$66=\"G\",Z178,0)","v":""},"G",null,null,{"$f":"IF($C$60=\"SEC\",I178,\"\")","v":""},{"$f":"IF($C$66=\"G\",AE178,0)","v":""},{"$f":"IF($C$60=\"SEC\",J178,\"\")","v":""},{"$f":"IF($C$66=\"G\",AG178,0)","v":""},{"$f":"IF($C$60=\"SEC\",K178,\"\")","v":""},{"$f":"IF($C$66=\"G\",AI178,0)","v":""}]
[null,"séché","GR",0,0,0,0,1000,{"$f":"IF(E179=0,\"\", 1.0684*E179 + 12.246)","v":""},{"$f":"IF(E179=0,\"\", 1.9027*E179 - 15.55)","v":""},{"$f":"IF(E179=0,\"\", 0.0023*E179^2 - 1.3048*E179 + 306.95)","v":""},0,0,0,{"$error":"#DIV/0!"},{"$error":"#DIV/0!"},{"$error":"#DIV/0!"},{"$error":"#DIV/0!"},{"$error":"#DIV/0!"},{"$error":"#DIV/0!"},{"$f":"IF(E179=0,\"\",14.8+0.1292*O179+0.3494*P179-0.000226*R179-0.000713*S179)","v":""},{"$f":"IF(M179=0,\"\",6.6+0.1292*O179+0.3694*Q179-0.000226*R179-0.00067*T179)","v":""},{"$f":"IF(V144=0,\"\",75+0.0117*O179+0.0288*P179-0.000175*S179)","v":{"$error":"#DIV/0!"}},"","dMO par CB",{"$f":"IF($C$60=\"SEC\",X179,\"\")","v":""},{"$f":"IF($C$66=\"GR\",Z179,0)","v":0},"GR",null,null,"",{"$f":"IF($C$66=\"GR\",AE179,0)","v":0},"",{"$f":"IF($C$66=\"GR\",AG179,0)","v":0},"",{"$f":"IF($C$66=\"GR\",AI179,0)","v":0}]
[null,"séché","E ",0,0,0,0,1000,{"$f":"IF(E180=0,\"\", 0.9673*E180 + 43.126)","v":""},{"$f":"IF(E180=0,\"\", 1.6443*E180 + 38.422)","v":""},{"$f":"IF(E180=0,\"\", -0.0004*E180^2 + 0.1396*E180 + 78.539)","v":""},0,0,0,{"$error":"#DIV/0!"},{"$error":"#DIV/0!"},{"$error":"#DIV/0!"},{"$error":"#DIV/0!"},{"$error":"#DIV/0!"},{"$error":"#DIV/0!"},{"$f":"IF(E180=0,\"\",35.1+0.171*O180+0.1408*P180-0.000302*R180-0.000315*S180)","v":""},{"$f":"IF(M180=0,\"\",26.9+0.1711*O180+0.1809*Q180-0.000302*R180-0.000343*T180)","v":""},{"$f":"IF(V144=0,\"\",110.7-0.0476*O180-0.121*P180)","v":{"$error":"#DIV/0!"}},"","dMO par CB","",{"$f":"IF($C$66=\"E\",Z180,0)","v":0},"E ",null,null,"",{"$f":"IF($C$66=\"E\",AE180,0)","v":0},"",{"$f":"IF($C$66=\"E\",AG180,0)","v":0},"",{"$f":"IF($C$66=\"E\",AI180,0)","v":0}]
[null,"séché","ER ",0,0,0,0,1000,{"$f":"IF(E181=0,\"\", 1.0747*E181 + 16.812)","v":""},{"$f":"IF(E181=0,\"\", 1.9253*E181 - 31.412)","v":""},{"$f":"IF(E181=0,\"\", 0.0007*E181^2 - 0.3657*E181 + 166.76)","v":""},0,0,0,{"$error":"#DIV/0!"},{"$error":"#DIV/0!"},{"$error":"#DIV/0!"},{"$error":"#DIV/0!"},{"$error":"#DIV/0!"},{"$error":"#DIV/0!"},{"$f":"IF(E181=0,\"\",35.8+0.092*O181+0.2539*P181-0.000162*R181-0.000609*S181)","v":""},{"$f":"IF(M181=0,\"\",27.3+0.0924*O181+0.2846*Q181-0.000162*R181-0.000581*T181)","v":""},{"$f":"IF(V144=0,\"\",91.6-0.0072*O181-0.0513*P181-0.000055*S181)","v":{"$error":"#DIV/0!"}},"","dMO par CB","",{"$f":"IF($C$66=\"ER\",Z181,0)","v":0},"ER ",null,null,"",{"$f":"IF($C$66=\"ER\",AE181,0)","v":0},"",{"$f":"IF($C$66=\"ER\",AG181,0)","v":0},"",{"$f":"IF($C$66=\"ER\",AI181,0)","v":0}]
[null,"séché","L ",0,0,0,0,1000,{"$f":"IF(E182=0,\"\", 1.0964*E182 + 20.95)","v":""},{"$f":"IF(E182=0,\"\", 1.547*E182 + 27.134)","v":""},{"$f":"IF(E182=0,\"\", 0.001*E182^2 -0.4922*E182 + 153.24)","v":""},0,0,0,{"$error":"#DIV/0!"},{"$error":"#DIV/0!"},{"$error":"#DIV/0!"},{"$error":"#DIV/0!"},{"$error":"#DIV/0!"},{"$error":"#DIV/0!"},{"$f":"IF(E182=0,\"\",80.4-0.000189*S182)","v":""},{"$f":"IF(M182=0,\"\",81.6-0.000149*T182)","v":""},{"$f":"IF(V144=0,\"\",118.8-0.000229*R182-0.1546*P182)","v":{"$error":"#DIV/0!"}},"","dMO par CB","",{"$f":"IF($C$66=\"L\",Z182,0)","v":0},"L ",null,null,"",{"$f":"IF($C$66=\"L\",AE182,0)","v":0},"",{"$f":"IF($C$66=\"L\",AG182,0)","v":0},"",{"$f":"IF($C$66=\"L\",AI182,0)","v":0}]
[null,"séché","DF ",0,0,0,0,1000,{"$f":"IF(E183=0,\"\", 0.9484*E183 + 54.064)","v":""},{"$f":"IF(E183=0,\"\", 1.8063*E183 - 23.954)","v":""},{"$f":"IF(E183=0,\"\", 0.0004*E183^2 - 0.266*E183 + 140.2)","v":""},0,0,0,{"$error":"#DIV/0!"},{"$error":"#DIV/0!"},{"$error":"#DIV/0!"},{"$error":"#DIV/0!"},{"$error":"#DIV/0!"},{"$error":"#DIV/0!"},{"$f":"IF(E183=0,\"\",52.2+0.0845*O183+0.1341*P183-0.000147*R183-0.000385*S183)","v":""},{"$f":"IF(M183=0,\"\",41.7+0.0829*O183+0.1981*Q183-0.000143*R183-0.000439*T183)","v":""},{"$f":"IF(V144=0,\"\",133.5-0.0638*O183-0.3265*P183+0.000369*S183)","v":{"$error":"#DIV/0!"}},"","dMO par CB","",{"$f":"IF($C$66=\"DF\",Z183,0)","v":0},"DF ",null,null,"",{"$f":"IF($C$66=\"DF\",AE183,0)","v":0},"",{"$f":"IF($C$66=\"DF\",AG183,0)","v":0},"",{"$f":"IF($C$66=\"DF\",AI183,0)","v":0}]
[null,"séché","DT ",0,0,0,0,1000,{"$f":"IF(E184=0,\"\", 1.2405*E184 + 1.1376)","v":""},{"$f":"IF(E184=0,\"\", 1.8784*E184 - 37.912)","v":""},{"$f":"IF(E184=0,\"\", 0.0004*E184^2 - 0.2928*E184 + 153.75)","v":""},0,0,0,{"$error":"#DIV/0!"},{"$error":"#DIV/0!"},{"$error":"#DIV/0!"},{"$error":"#DIV/0!"},{"$error":"#DIV/0!"},{"$error":"#DIV/0!"},{"$f":"IF(E184=0,\"\",37.6+0.194*O184+0.1411*P184-0.000363*R184-0.000425*S184)","v":""},{"$f":"IF(M184=0,\"\",29.9+0.1947*O184+0.1464*Q184-0.000365*R184-0.000278*T184)","v":""},{"$f":"IF(V144=0,\"\",133.5-0.0638*O184-0.3265*P184+0.000369*S184)","v":{"$error":"#DIV/0!"}},"","dMO par CB","",{"$f":"IF($C$66=\"DT\",Z184,0)","v":0},"DT ",null,null,"",{"$f":"IF($C$66=\"DT\",AE184,0)","v":0},"",{"$f":"IF($C$66=\"DT\",AG184,0)","v":0},"",{"$f":"IF($C$66=\"DT\",AI184,0)","v":0}]
[null,"séché","IND ",0,0,0,0,1000,{"$f":"IF(E185=0,\"\", 1.0607*E185 + 25.317)","v":""},{"$f":"IF(E185=0,\"\", 1.5436*E193 + 68.821)","v":""},{"$f":"IF(E185=0,\"\", -0.003*E185^2 + 1.4813*E185 - 73.603)","v":""},0,0,0,{"$error":"#DIV/0!"},{"$error":"#DIV/0!"},{"$error":"#DIV/0!"},{"$error":"#DIV/0!"},{"$error":"#DIV/0!"},{"$error":"#DIV/0!"},{"$f":"IF(E185=0,\"\",50.6+0.136*O185+0.0952*P185-0.000282*R185-0.00028*S185)","v":""},{"$f":"IF(M185=0,\"\",48.5+0.121*O185+0.1214*Q185-0.000254*R185-0.0003*T185)","v":""},{"$f":"IF(V144=0,\"\",70.6+0.0815*O185-0.000173*R185-0.000109*S185)","v":{"$error":"#DIV/0!"}},"","dMO par CB","",{"$f":"IF($C$66=\"INC\",Z185,0)","v":0},"IND ",null,null,"",{"$f":"IF($C$66=\"INC\",AE185,0)","v":0},"",{"$f":"IF($C$66=\"INC\",AG185,0)","v":0},"",{"$f":"IF($C$66=\"INC\",AI185,0)","v":0}]
[null,"séché","dg",0,0,0,0,1000,{"$f":"IF(E186=0,\"\", 0.9741*E186 + 31.782)","v":""},{"$f":"IF(E186=0,\"\", 1.358*E186 + 156)","v":""},{"$f":"IF(E186=0,\"\", 0.0011*E186^2 -0.6995*E186 +195.45)","v":""},0,0,0,{"$error":"#DIV/0!"},{"$error":"#DIV/0!"},{"$error":"#DIV/0!"},{"$error":"#DIV/0!"},{"$error":"#DIV/0!"},{"$error":"#DIV/0!"},{"$f":"IF(E186=0,\"\",87.6-0.000187*S186)","v":""},{"$f":"IF(M186=0,\"\",90.1-0.00018*T186)","v":""},null,"","dMO par CB","",{"$f":"IF($C$66=\"dg\",Z186,0)","v":0},"dg",null,null,"",{"$f":"IF($C$66=\"dg\",AE186,0)","v":0},"",{"$f":"IF($C$66=\"dg\",AG186,0)","v":0},"",{"$f":"IF($C$66=\"dg\",AI186,0)","v":0}]
[null,"séché","lp",0,0,0,0,1000,{"$f":"IF(E187=0,\"\", 1.1871*E187 - 25.321)","v":""},{"$f":"IF(E187=0,\"\", 2.0965*E187 - 52.379)","v":""},{"$f":"IF(E187=0,\"\", 0.0109*E187^2 - 6.0701*E187 + 988.42)","v":""},0,0,0,{"$error":"#DIV/0!"},{"$error":"#DIV/0!"},{"$error":"#DIV/0!"},{"$error":"#DIV/0!"},{"$error":"#DIV/0!"},{"$error":"#DIV/0!"},{"$f":"IF(E187=0,\"\",93.5-0.000291*S187)","v":""},{"$f":"IF(M187=0,\"\",92.3-0.000236*T187)","v":""},{"$f":"IF(V144=0,\"\",131.1-0.0159*O187-0.3102*P187+0.000369*S187)","v":{"$error":"#DIV/0!"}},"","dMO par CB","",{"$f":"IF($C$66=\"lp\",Z187,0)","v":0},"lp",null,null,"",{"$f":"IF($C$66=\"lp\",AE187,0)","v":0},"",{"$f":"IF($C$66=\"lp\",AG187,0)","v":0},"",{"$f":"IF($C$66=\"lp\",AI187,0)","v":0}]
[null,"séché","li",0,0,0,0,1000,{"$f":"IF(E188=0,\"\", 1.2035*E188 - 20.333)","v":""},{"$f":"IF(E188=0,\"\", 1.7517*E188 + 34.706)","v":""},{"$f":"IF(E188=0,\"\", -0.0004*E188^2 + 0.1567*E188 + 154.25)","v":""},0,0,0,{"$error":"#DIV/0!"},{"$error":"#DIV/0!"},{"$error":"#DIV/0!"},{"$error":"#DIV/0!"},{"$error":"#DIV/0!"},{"$error":"#DIV/0!"},{"$f":"IF(E188=0,\"\",95.5-0.00037*S188)","v":""},{"$f":"IF(M188=0,\"\",93.9-0.000277*T188)","v":""},{"$f":"IF(V144=0,\"\",131.1-0.0159*O188-0.3102*P188+0.000369*S188)","v":{"$error":"#DIV/0!"}},"","dMO par CB","",{"$f":"IF($C$66=\"li\",Z188,0)","v":0},"li",null,null,"",{"$f":"IF($C$66=\"li\",AE188,0)","v":0},"",{"$f":"IF($C$66=\"li\",AG188,0)","v":0},"",{"$f":"IF($C$66=\"li\",AI188,0)","v":0}]
[null,"séché","ap",0,0,0,0,1000,{"$f":"IF(E189=0,\"\", 1.2149*E189 - 32.263)","v":""},{"$f":"IF(E189=0,\"\", 2.1722*E189 - 76.853)","v":""},{"$f":"IF(E189=0,\"\", 0.0032*E189^2 - 2.2697*E189 + 456.68)","v":""},0,0,0,{"$error":"#DIV/0!"},{"$error":"#DIV/0!"},{"$error":"#DIV/0!"},{"$error":"#DIV/0!"},{"$error":"#DIV/0!"},{"$error":"#DIV/0!"},{"$f":"IF(E189=0,\"\",98-0.000322*S189)","v":""},{"$f":"IF(M189=0,\"\",95.8-0.000249*T189)","v":""},null,"","dMO par CB","",{"$f":"IF($C$66=\"ap\",Z189,0)","v":0},"ap",null,null,"",{"$f":"IF($C$66=\"ap\",AE189,0)","v":0},"",{"$f":"IF($C$66=\"ap\",AG189,0)","v":0},"",{"$f":"IF($C$66=\"ap\",AI189,0)","v":0}]
[null,"séché","tr",0,0,0,0,1000,{"$f":"IF(E190=0,\"\", 1.2727*E190 + 3.5455)","v":""},{"$f":"IF(E190=0,\"\", 1.5621*E190 - 13.457)","v":""},{"$f":"IF(E190=0,\"\", -0.0069*E190^2 + 2.517*E190 - 160.32)","v":""},0,0,0,{"$error":"#DIV/0!"},{"$error":"#DIV/0!"},{"$error":"#DIV/0!"},{"$error":"#DIV/0!"},{"$error":"#DIV/0!"},{"$error":"#DIV/0!"},{"$f":"IF(E190=0,\"\",81-0.000216*S190)","v":""},{"$f":"IF(M190=0,\"\",80.9-0.000129*T190)","v":""},null,"","dMO par CB","",{"$f":"IF($C$66=\"tr\",Z190,0)","v":0},"tr",null,null,"",{"$f":"IF($C$66=\"tr\",AE190,0)","v":0},"",{"$f":"IF($C$66=\"tr\",AG190,0)","v":0},"",{"$f":"IF($C$66=\"tr\",AI190,0)","v":0}]
[null,"séché","tp",0,0,0,0,1000,{"$f":"IF(E191=0,\"\", 1.125*E191 + 17.991)","v":""},{"$f":"IF(E191=0,\"\", 1.3119*E191 + 52.525)","v":""},{"$f":"IF(E191=0,\"\", -0.002*E191^2 -0.0002*E191 +89.572)","v":""},0,0,0,{"$error":"#DIV/0!"},{"$error":"#DIV/0!"},{"$error":"#DIV/0!"},{"$error":"#DIV/0!"},{"$error":"#DIV/0!"},{"$error":"#DIV/0!"},{"$f":"IF(E191=0,\"\",77.6-0.000156*S191)","v":""},{"$f":"IF(M191=0,\"\",78.3-0.000116*T191)","v":""},null,"","dMO par CB","",{"$f":"IF($C$66=\"tp\",Z191,0)","v":0},"tp",null,null,"",{"$f":"IF($C$66=\"tp\",AE191,0)","v":0},"",{"$f":"IF($C$66=\"tp\",AG191,0)","v":0},"",{"$f":"IF($C$66=\"tp\",AI191,0)","v":0}]
[null,"séché","luz",0,0,0,0,1000,{"$f":"IF(E192=0,\"\", 1.057*E192 + 32.991)","v":""},{"$f":"IF(E192=0,\"\", 1.2979*E192 + 27.166)","v":""},{"$f":" IF(E192=0,\"\",0.0001*E192^2 - 0.1174*E192 + 68.617)","v":""},0,0,0,{"$error":"#DIV/0!"},{"$error":"#DIV/0!"},{"$error":"#DIV/0!"},{"$error":"#DIV/0!"},{"$error":"#DIV/0!"},{"$error":"#DIV/0!"},{"$f":"IF(E192=0,\"\",76.8-0.000131*S192)","v":""},{"$f":"IF(M192=0,\"\",78.1-0.000107*T192)","v":""},{"$f":"IF(V144=0,\"\",96.8-0.0218*O192-0.0655*P192-0.000057*S192)","v":{"$error":"#DIV/0!"}},"","dMO par CB","",{"$f":"IF($C$66=\"LUZ\",Z192,0)","v":0},"luz",null,null,"",{"$f":"IF($C$66=\"LUZ\",AE192,0)","v":0},"",{"$f":"IF($C$66=\"LUZ\",AG192,0)","v":0},"",{"$f":"IF($C$66=\"LUZ\",AI192,0)","v":0}]
[null,"séché","maïs",0,0,0,0,1000,{"$f":"IF(E193=0,\"\",\"pas d'équation\")","v":""},{"$f":"IF(E193=0,\"\",\"pas d'équation\")","v":""},{"$f":"IF(E193=0,\"\",\"pas d'équation\")","v":""},0,0,null,null,null,null,null,null,null,null,null,null,0,"dMO par CB",{"$f":"IF($C$60=\"SEC\",X193,\"\")","v":""},{"$f":"IF($C$66=\"MAÏS\",Z193,0)","v":0},"maïs",null,null,{"$f":"IF($C$60=\"SEC\",I193,\"\")","v":""},{"$f":"IF($C$66=\"MAÏS\",AE193,0)","v":0},"",{"$f":"IF($C$66=\"MAÏS\",AG193,0)","v":0},"",{"$f":"IF($C$66=\"MAÏS\",AI193,0)","v":0}]
[null,"dzu","G",0,0,0,0,1000,{"$f":"IF(E194=0,\"\", 1.0106*E194 + 40.486)","v":""},{"$f":"IF(E194=0,\"\", 1.7104*E194 + 59.376)","v":""},{"$f":"IF(E194=0,\"\", -0.0011*E194^2 + 0.5214*E194 +31.798)","v":""},0,0,0,{"$f":"D194/N194*1000","v":{"$error":"#DIV/0!"}},{"$f":"E194/N194*1000","v":{"$error":"#DIV/0!"}},{"$error":"#DIV/0!"},{"$error":"#DIV/0!"},{"$error":"#DIV/0!"},{"$error":"#DIV/0!"},{"$f":"IF(E194=0,\"\",65.3+0.0869*O194+0.0692*P194-0.000175*R194-0.000299*S194)","v":""},{"$f":"IF(F194=0,\"\",57.4+0.1132*O194+0.1171*Q194-0.000271*R194-0.000336*T194)","v":""},{"$f":"IF(V144=0,\"\",82.5-0.000145*S194)","v":{"$error":"#DIV/0!"}},"","dMO par CB",{"$f":"IF($C$60=\"DZU\",X194,\"\")","v":""},{"$f":"IF($C$66=\"G\",Z194,0)","v":""},"G",null,null,{"$f":"IF($C$60=\"DZU\",I194,\"\")","v":""},{"$f":"IF($C$66=\"G\",AE194,0)","v":""},{"$f":"IF($C$60=\"DZU\",J194,\"\")","v":""},{"$f":"IF($C$66=\"G\",AG194,0)","v":""},{"$f":"IF($C$60=\"DZU\",K194,\"\")","v":""},{"$f":"IF($C$66=\"G\",AI194,0)","v":""}]
[null,"dzu","GR",0,0,0,0,1000,{"$f":" IF(E195=0,\"\",1.0697*E195 + 25.013)","v":""},{"$f":"IF(E195=0,\"\", 1.889*E195 + 11.584)","v":""},{"$f":"IF(E195=0,\"\", 0.0023*E195^2 - 1.2472*E195 + 298.7)","v":""},0,0,0,{"$error":"#DIV/0!"},{"$error":"#DIV/0!"},{"$error":"#DIV/0!"},{"$error":"#DIV/0!"},{"$error":"#DIV/0!"},{"$error":"#DIV/0!"},{"$f":"IF(E195=0,\"\",63.8+0.1905*P195-0.000602*S195)","v":""},{"$f":"IF(F195=0,\"\",41.4+0.3186*Q195-0.000707*T195)","v":""},{"$f":"IF(V144=0,\"\",82.7-0.000124*S195)","v":{"$error":"#DIV/0!"}},"","dMO par CB",{"$f":"IF($C$60=\"DZU\",X195,\"\")","v":""},{"$f":"IF($C$66=\"GR\",Z195,0)","v":0},"GR",null,null,{"$f":"IF($C$60=\"DZU\",I195,\"\")","v":""},{"$f":"IF($C$66=\"GR\",AE195,0)","v":0},"",{"$f":"IF($C$66=\"GR\",AG195,0)","v":0},"",{"$f":"IF($C$66=\"GR\",AI195,0)","v":0}]
[null,"dzu","E ",0,0,0,0,1000,{"$f":"IF(E196=0,\"\", 1.0213*E196 + 42.825)","v":""},{"$f":"IF(E196=0,\"\", 1.7604*E196 + 32.268)","v":""},{"$f":"IF(E196=0,\"\", -0.0008*E196^2 + 0.3532*E196 +57.161)","v":""},0,0,0,{"$error":"#DIV/0!"},{"$error":"#DIV/0!"},{"$error":"#DIV/0!"},{"$error":"#DIV/0!"},{"$error":"#DIV/0!"},{"$error":"#DIV/0!"},{"$f":"IF(E196=0,\"\",80.8+0.0383*P196-0.000285*S196)","v":""},{"$f":"IF(F196=0,\"\",66.4+0.1432*Q196-0.000404*T196)","v":""},{"$f":"IF(V144=0,\"\",84.1-0.00003*R196-0.000145*S196)","v":{"$error":"#DIV/0!"}},"","dMO par CB","",{"$f":"IF($C$66=\"E\",Z196,0)","v":0},"E ",null,null,"",{"$f":"IF($C$66=\"E\",AE196,0)","v":0},"",{"$f":"IF($C$66=\"E\",AG196,0)","v":0},"",{"$f":"IF($C$66=\"E\",AI196,0)","v":0}]
[null,"dzu","ER ",0,0,0,0,1000,{"$f":"IF(E197=0,\"\", 1.022*E197 + 42.236)","v":""},{"$f":"IF(E197=0,\"\", 1.8612*E197 + 7.4654)","v":""},{"$f":"IF(E197=0,\"\", 0.0011*E197^2 - 0.5642*E197 + 193.99)","v":""},0,0,0,{"$error":"#DIV/0!"},{"$error":"#DIV/0!"},{"$error":"#DIV/0!"},{"$error":"#DIV/0!"},{"$error":"#DIV/0!"},{"$error":"#DIV/0!"},{"$f":"IF(E197=0,\"\",63.2+0.1888*P197-0.00061*S197)","v":""},{"$f":"IF(F197=0,\"\",42.7+0.309*Q197-0.000697*T197)","v":""},{"$f":"IF(V144=0,\"\",84.4-0.0029*O197-0.000124*S197)","v":{"$error":"#DIV/0!"}},"","dMO par CB","",{"$f":"IF($C$66=\"ER\",Z197,0)","v":0},"ER ",null,null,"",{"$f":"IF($C$66=\"ER\",AE197,0)","v":0},"",{"$f":"IF($C$66=\"ER\",AG197,0)","v":0},"",{"$f":"IF($C$66=\"ER\",AI197,0)","v":0}]
[null,"dzu","L ",0,0,0,0,1000,{"$f":"IF(E198=0,\"\", 1.0657*E198 + 41.069)","v":""},{"$f":"IF(E198=0,\"\", 1.5277*E198 + 51.073)","v":""},{"$f":"IF(E198=0,\"\", 0.0007*E198^2 -0.3378*E198 + 140.87)","v":""},0,0,0,{"$error":"#DIV/0!"},{"$error":"#DIV/0!"},{"$error":"#DIV/0!"},{"$error":"#DIV/0!"},{"$error":"#DIV/0!"},{"$error":"#DIV/0!"},{"$f":"IF(E198=0,\"\",74.8+0.0693*P198-0.000363*S198)","v":""},{"$f":"IF(F198=0,\"\",68.3+0.1159*Q198-0.00036*T198)","v":""},{"$f":"IF(V144=0,\"\",91.5-0.0336*O198-0.00018*S198)","v":{"$error":"#DIV/0!"}},"","dMO par CB","",{"$f":"IF($C$66=\"L\",Z198,0)","v":0},"L ",null,null,"",{"$f":"IF($C$66=\"L\",AE198,0)","v":0},"",{"$f":"IF($C$66=\"L\",AG198,0)","v":0},"",{"$f":"IF($C$66=\"L\",AI198,0)","v":0}]
[null,"dzu","DF ",0,0,0,0,1000,{"$f":"IF(E199=0,\"\", 1.1106*E199 + 38.491)","v":""},{"$f":"IF(E199=0,\"\", 1.9114*E199 - 18.378)","v":""},{"$f":"IF(E199=0,\"\", 0.0031*E199^2 - 1.2797*E199 + 238.44)","v":""},0,0,0,{"$error":"#DIV/0!"},{"$error":"#DIV/0!"},{"$error":"#DIV/0!"},{"$error":"#DIV/0!"},{"$error":"#DIV/0!"},{"$error":"#DIV/0!"},{"$f":"IF(E199=0,\"\",70.2+0.1057*P199-0.000414*S199)","v":""},{"$f":"IF(F199=0,\"\",50.21+0.2478*Q199-0.000582*T199)","v":""},{"$f":"IF(V144=0,\"\",82-0.000232*S199)","v":{"$error":"#DIV/0!"}},"","dMO par CB","",{"$f":"IF($C$66=\"DF\",Z199,0)","v":0},"DF ",null,null,"",{"$f":"IF($C$66=\"DF\",AE199,0)","v":0},"",{"$f":"IF($C$66=\"DF\",AG199,0)","v":0},"",{"$f":"IF($C$66=\"DF\",AI199,0)","v":0}]
[null,"dzu","DT ",0,0,0,0,1000,{"$f":"IF(E200=0,\"\", 1.1808*E200 + 28.253)","v":""},{"$f":"IF(E200=0,\"\", 1.9087*E200 - 18.369)","v":""},{"$f":"IF(E200=0,\"\", 0.0013*E200^2 - 0.6398*E200 + 190.2)","v":""},0,0,0,{"$error":"#DIV/0!"},{"$error":"#DIV/0!"},{"$error":"#DIV/0!"},{"$error":"#DIV/0!"},{"$error":"#DIV/0!"},{"$error":"#DIV/0!"},{"$f":"IF(E200=0,\"\",56.6+0.1229*O200+0.1021*P200-0.000237*R200-0.000459*S200)","v":""},{"$f":"IF(F200=0,\"\",48.4+0.2396*O200+0.0452*Q200-0.000507*R200-0.0002*T200)","v":""},{"$f":"IF(V144=0,\"\",82-0.000323*S200)","v":{"$error":"#DIV/0!"}},"","dMO par CB","",{"$f":"IF($C$66=\"DT\",Z200,0)","v":0},"DT ",null,null,"",{"$f":"IF($C$66=\"DT\",AE200,0)","v":0},"",{"$f":"IF($C$66=\"DT\",AG200,0)","v":0},"",{"$f":"IF($C$66=\"DT\",AI200,0)","v":0}]
[null,"dzu","IND ",0,0,0,0,1000,{"$f":"IF(E201=0,\"\", 0.912*E201 + 69.778)","v":""},{"$f":"IF(E201=0,\"\", 1.9765*E201 - 28.485)","v":""},{"$f":"IF(E201=0,\"\", -0.0061*E201^2 + 2.7316*E201 - 190.18)","v":""},0,0,0,{"$error":"#DIV/0!"},{"$error":"#DIV/0!"},{"$error":"#DIV/0!"},{"$error":"#DIV/0!"},{"$error":"#DIV/0!"},{"$error":"#DIV/0!"},{"$f":"IF(E201=0,\"\",48.6+0.1603*O201+0.071*P201-0.000344*R201-0.00025*S201)","v":""},{"$f":"IF(F201=0,\"\",42.8+0.145*O201+0.1241*Q201-0.00032*R201-0.000305*T201)","v":""},{"$f":"IF(V144=0,\"\",76.6+0.0165*O201-0.000097*S201)","v":{"$error":"#DIV/0!"}},"","dMO par CB","",{"$f":"IF($C$66=\"INC\",Z201,0)","v":0},"IND ",null,null,"",{"$f":"IF($C$66=\"INC\",AE201,0)","v":0},"",{"$f":"IF($C$66=\"INC\",AG201,0)","v":0},"",{"$f":"IF($C$66=\"INC\",AI201,0)","v":0}]
[null,"dzu","dg",0,0,0,0,1000,{"$f":"IF(E202=0,\"\", 0.9485*E202 + 50.603)","v":""},{"$f":"IF(E202=0,\"\", 1.3544*E202 + 173.43)","v":""},{"$f":"IF(E202=0,\"\", 0.0003*E202^2 -0.2328*E202+130.78)","v":""},0,0,0,{"$error":"#DIV/0!"},{"$error":"#DIV/0!"},{"$error":"#DIV/0!"},{"$error":"#DIV/0!"},{"$error":"#DIV/0!"},{"$error":"#DIV/0!"},{"$f":"IF(E202=0,\"\",0)","v":""},"",{"$f":"IF(V144=0,\"\",0)","v":{"$error":"#DIV/0!"}},"","dMO par CB","",{"$f":"IF($C$66=\"dg\",Z202,0)","v":0},"dg",null,null,"",{"$f":"IF($C$66=\"dg\",AE202,0)","v":0},"",{"$f":"IF($C$66=\"dg\",AG202,0)","v":0},"",{"$f":"IF($C$66=\"dg\",AI202,0)","v":0}]
[null,"dzu","lp",0,0,0,0,1000,{"$f":"IF(E203=0,\"\", 1.1394*E203 + 0.7383)","v":""},{"$f":"IF(E203=0,\"\", 2.0725*E203 - 20.701)","v":""},{"$f":"IF(E203=0,\"\", 0.012*E203^2 - 6.3581*E203 + 991.84)","v":""},0,0,0,{"$error":"#DIV/0!"},{"$error":"#DIV/0!"},{"$error":"#DIV/0!"},{"$error":"#DIV/0!"},{"$error":"#DIV/0!"},{"$error":"#DIV/0!"},"","",null,"","dMO par CB","",{"$f":"IF($C$66=\"lp\",Z203,0)","v":0},"lp",{"$f":"IF($J$60=3,W209,0)","v":0},"dMOmaïs LV99","",{"$f":"IF($C$66=\"lp\",AE203,0)","v":0},"",{"$f":"IF($C$66=\"lp\",AG203,0)","v":0},"",{"$f":"IF($C$66=\"lp\",AI203,0)","v":0}]
[null,"dzu","li",0,0,0,0,1000,{"$f":"IF(E204=0,\"\", 1.1721*E204 + 2.3354)","v":""},{"$f":"IF(E204=0,\"\", 1.722*E204 + 63.087)","v":""},{"$f":"IF(E204=0,\"\", -0.0009*E204^2 + 0.3681*E204 + 141.55)","v":""},0,0,0,{"$error":"#DIV/0!"},{"$error":"#DIV/0!"},{"$error":"#DIV/0!"},{"$error":"#DIV/0!"},{"$error":"#DIV/0!"},{"$error":"#DIV/0!"},"","",null,"","dMO par CB","",{"$f":"IF($C$66=\"li\",Z204,0)","v":0},"li",{"$f":"IF(AND($A$84=4,$J$60=1),U208,0)","v":0},"dMOmaïs LV06 par CB (INRA)","",{"$f":"IF($C$66=\"li\",AE204,0)","v":0},"",{"$f":"IF($C$66=\"li\",AG204,0)","v":0},"",{"$f":"IF($C$66=\"li\",AI204,0)","v":0}]
[null,"dzu","ap",0,0,0,0,1000,{"$f":"IF(E205=0,\"\", 1.1677*E205 - 4.0533)","v":""},{"$f":" IF(E205=0,\"\",2.1029*E205 - 30.814)","v":""},{"$f":"IF(E205=0,\"\", 0.004*E205^2 - 2.6453*E205 + 498.69)","v":""},0,0,0,{"$error":"#DIV/0!"},{"$error":"#DIV/0!"},{"$error":"#DIV/0!"},{"$error":"#DIV/0!"},{"$error":"#DIV/0!"},{"$error":"#DIV/0!"},{"$f":"IF(E205=0,\"\",0)","v":""},"",null,"","dMO par CB","",{"$f":"IF($C$66=\"ap\",Z205,0)","v":0},"ap",{"$f":"IF(AND($A$84=4,$J$60=2),U208,0)","v":0},"dMO maïs LV06 par ADFNDF (INRA)","",{"$f":"IF($C$66=\"ap\",AE205,0)","v":0},"",{"$f":"IF($C$66=\"ap\",AG205,0)","v":0},"",{"$f":"IF($C$66=\"ap\",AI205,0)","v":0}]
[null,"dzu","tr",0,0,0,0,1000,{"$f":"IF(E206=0,\"\", 1.2857*E206 + 18.429)","v":""},{"$f":"IF(E206=0,\"\", 1.5594*E206 + 8.3748)","v":""},{"$f":"IF(E206=0,\"\", -0.0063*E206^2 + 2.1074*E206 - 104.16)","v":""},0,0,0,{"$error":"#DIV/0!"},{"$error":"#DIV/0!"},{"$error":"#DIV/0!"},{"$error":"#DIV/0!"},{"$error":"#DIV/0!"},{"$error":"#DIV/0!"},{"$f":"IF(E206=0,\"\",0)","v":""},"",null,"","dMO par CB","",{"$f":"IF($C$66=\"tr\",Z206,0)","v":0},"tr",{"$f":"IF(AND($A$84=1,$J$60=1),100*((((N209*U209/100)*1.2812)-180.35)/N209),0)","v":{"$error":"#VALUE!"}},"dMOmaïscorr. Par MOD dMOCB: 1.2812 x MOD CB -180.35","",{"$f":"IF($C$66=\"tr\",AE206,0)","v":0},"",{"$f":"IF($C$66=\"tr\",AG206,0)","v":0},"",{"$f":"IF($C$66=\"tr\",AI206,0)","v":0}]
[null,"dzu","tp",0,0,0,0,1000,{"$f":"IF(E207=0,\"\", 1.1148*E207 + 35.265)","v":""},{"$f":"IF(E207=0,\"\", 1.2903*E207 + 74.94)","v":""},{"$f":"IF(E207=0,\"\", 0.0001*E207^2 -0.0619*E207 +95.389)","v":""},0,0,0,{"$error":"#DIV/0!"},{"$error":"#DIV/0!"},{"$error":"#DIV/0!"},{"$error":"#DIV/0!"},{"$error":"#DIV/0!"},{"$error":"#DIV/0!"},{"$f":"IF(E207=0,\"\",0)","v":""},"",null,"","dMO par CB","",{"$f":"IF($C$66=\"tp\",Z207,0)","v":0},"tp",{"$f":"IF(AND($A$84=1,$J$60=2),100*((((N209*V209/100)*1.2653)-156.12)/N209),0)","v":0},"dMOmaïs corr. Par MOD dMOADF : 1.2653 x MOD ADF - 156.12","",{"$f":"IF($C$66=\"tp\",AE207,0)","v":0},"",{"$f":"IF($C$66=\"tp\",AG207,0)","v":0},"",{"$f":"IF($C$66=\"tp\",AI207,0)","v":0}]
[null,"dzu","luz",0,0,0,0,1000,{"$f":"IF(E208=0,\"\", 1.0342*E208 + 51.855)","v":""},{"$f":"IF(E208=0,\"\",1.2761*E208 + 49.236)","v":""},{"$f":"IF(E208=0,\"\", 0.00005*E208^2 - 0.0826*E208 + 66.837)","v":""},0,0,0,{"$error":"#DIV/0!"},{"$error":"#DIV/0!"},{"$error":"#DIV/0!"},{"$error":"#DIV/0!"},{"$error":"#DIV/0!"},{"$error":"#DIV/0!"},{"$f":"IF(E208=0,\"\",78.7-0.000149*S208)","v":""},{"$f":"IF(M208=0,\"\",80.8-0.000118*T208)","v":""},{"$f":"IF(_Wv43=0,\"\",115.3-0.0479*O208-0.1409*P208+0.000063*S208)","v":{"$error":"#NAME?"}},"","dMO par CB","",{"$f":"IF($C$66=\"LUZ\",Z208,0)","v":0},"luz",{"$f":"IF(AND($A$84=2,$J$60<3),100*((-1016.7+($J$115*1.8)+(($J$109*$J$117/1000)*1.106)+(($M$109*$M$115/1000)*(-3.01))+(($M$110*$M$111/1000)*(-0.0013))+10.3)/$J$115),0)","v":0},"dMOmaïs PE équation ALP12","",{"$f":"IF($C$66=\"LUZ\",AE208,0)","v":0},"",{"$f":"IF($C$66=\"LUZ\",AG208,0)","v":0},"",{"$f":"IF($C$66=\"LUZ\",AI208,0)","v":0}]
[null,"dzu","maïs",0,0,0,0,1000,{"$f":"IF(E209=0,\"\", 1.1186*E209 + 8.0113)","v":""},{"$f":"IF(E209=0,\"\", 1.4381*E209 +155.24)","v":""},{"$f":"IF(E209=0,\"\", 0.0028*E209^2 + 1.2371*E209 -74.894)","v":""},0,0,0,{"$error":"#DIV/0!"},{"$error":"#DIV/0!"},{"$error":"#DIV/0!"},{"$error":"#DIV/0!"},{"$error":"#DIV/0!"},{"$error":"#DIV/0!"},{"$f":"IF(E209=0,\"\",79.4+0.0652*O209-0.0591*P209)","v":""},{"$f":"IF(M209=0,\"\",IF(L209=0,\"\",75.7+0.0701*O209+0.0156*L209/N209*1000-0.072*Q209))","v":""},{"$f":"IF(V144=0,\"\",69.2+0.164*O209-0.000218*S209)","v":{"$error":"#DIV/0!"}},"","dMO par CB","",{"$f":"IF(Z209=\"\",\"\",IF($C$66=\"MAÏS\",SUM(AC204:AC209),0))","v":""},"maïs",{"$f":"IF(AND($A$84=3,$J$60<3),100*((-1016.7+($J$115*1.8)+(($J$109*$J$117/1000)*1.106)+(($M$109*$M$115/1000)*(-3.01))+(($M$110*$M$111/1000)*(-0.0013))-10.3)/$J$115),0)","v":0},"dMOmaïs pas PE équation ALP12","",{"$f":"IF($C$66=\"MAÏS\",AE209,0)","v":0},"",{"$f":"IF($C$66=\"MAÏS\",AG209,0)","v":0},"",{"$f":"IF($C$66=\"MAÏS\",AI209,0)","v":0}]
[null,null,null,null,null,null,null,null,"pas de régressions ou rég. LV99",null,null,null,null,null,null,null,null,null,null,null,"pas de regressions"]
[null,null,null,null,null,null,null,null,"reg ARY base dig-feva"]
[]
["Calcul de la valeur énergétique des fourrages"]
[]
["EB",{"$f":"IF(B66=16,B218,B217)","v":0}]
[]
["EB exc.maïs",{"$f":"0.0188*J115+0.0078*J109","v":0}]
["EB maïs",{"$f":"0.0196*(J108-J111)","v":0}]
[]
["EM",{"$f":"C220*G2/100","v":{"$error":"#VALUE!"}},{"$f":"IF(B66=16,C225,IF(C221<7,C222,C223))","v":{"$error":"#VALUE!"}},null,null,null,{"$f":"ISERROR(C220)","v":true}]
["MOD/MAD",null,{"$f":"(J115*G18/100)/(J109*G19/100)","v":{"$error":"#VALUE!"}}]
["EM MOD/MA<7",null,{"$f":"0.0142*J115*(G18/100)+0.0059*C227","v":{"$error":"#VALUE!"}}]
["EM MOD/MAD>=7",null,{"$f":"0.01507*J115*G18/100","v":{"$error":"#VALUE!"}}]
[]
["EM Maïs PE",null,{"$f":"0.0155*J115*G18/100","v":{"$error":"#VALUE!"}}]
[]
["MAD reg ou donné",null,{"$f":"IF(I227<>C228,J109*I227/100,C228)","v":{"$error":"#DIV/0!"}},">>>>>>>>>","dMA issue",{"$f":"C227/J109*100","v":{"$error":"#DIV/0!"}},{"$f":"ISERROR(F227)","v":true},null,{"$f":"IF(G14=\"\",C228/J109*100,G14)","v":{"$error":"#DIV/0!"}}]
["MAD reg retenue ",null,{"$f":"IF(B60=1,C229,IF(B60=2,C229,IF(B60=3,C230,IF(B60=4,C230,\"erreur\"))))","v":{"$error":"#DIV/0!"}}]
["MAD vert+ensilage",null,{"$f":"J109*(0.33+0.0033*M109-0.0000061*M113)","v":{"$error":"#DIV/0!"}}]
["MAD sec+dzu artificiel",null,{"$f":"J109*(0.29+0.0033*M109-0.0000064*M113)","v":{"$error":"#DIV/0!"}}]
[]
["q",{"$f":"C220/B215","v":{"$error":"#VALUE!"}}]
["kL",{"$f":"0.463+0.24*B232","v":{"$error":"#VALUE!"}}]
["kEN",{"$f":"0.554+0.287*B232","v":{"$error":"#VALUE!"}}]
["kV",{"$f":"0.006+0.78*B232","v":{"$error":"#VALUE!"}}]
["kENV",{"$f":"(1.5*B234*B235)/((0.5*B234)+B235)","v":{"$error":"#VALUE!"}}]
[]
["Energie nette"]
["NEL",null,{"$f":"(B233*C220*0.9752)*G2/100","v":{"$error":"#VALUE!"}},null,null,null,{"$f":"ISERROR(C239)","v":true}]
["NEV",null,{"$f":"(B236*C220)*G2/100","v":{"$error":"#VALUE!"}},null,null,null,{"$f":"ISERROR(C240)","v":true}]
[]
[]
[]
["Calcul de la valeur azotée des fourrages",null,null,null,null,null,null,null,null,{"$f":"SUM(J249,J252,J254)","v":70},"deMA Maïs LV06",null,"Maïs",null,null,null,"maturité maïs vert"]
[null,null,"LV99",null,null,null,"LV06",null,null,null,"Etat","Stade","deMA","MS",{"$f":"M9","v":0},null,2]
["deMA",{"$f":"G10","v":""},{"$f":"IF(B66=16,C252,IF(B60=1,C247,IF(B60=2,C248,IF(B60=3,C250,IF(B60=4,C250,\"erreur!\")))))","v":{"$error":"#DIV/0!"}},null,{"$f":"ISERROR(B246)","v":false},null,{"$f":"IF(B66=16,G252,IF(B60=1,G247,IF(B60=2,H246,IF(B60=3,G250,IF(B60=4,G251,\"erreur!\")))))","v":{"$error":"#DIV/0!"}},{"$f":"IF(M9<50,G248,G249)","v":{"$error":"#DIV/0!"}},null,null,"vert","floraison",70,15,{"$f":"IF($O$245=0,0,IF($O$245>=15,IF($O$245<20,M246,0),0))","v":0},null,{"$f":"IF(Q245<=2,M247,M248)","v":70}]
[{"$f":"IF(F60=1,G246,C246)","v":{"$error":"#DIV/0!"}},"herbe",{"$f":"IF(M109=0,\"\",45.8+0.18*M109-0.00027*M113)","v":{"$error":"#DIV/0!"}},null,null,null,{"$f":"IF(M109=0,\"\",51.2+0.126*M109-0.00014*M113)","v":{"$error":"#DIV/0!"}},null,null,null,null,"laiteux",70,20,{"$f":"IF($O$245=0,0,IF($O$245>=22,IF($O$245<26,M247,0),0))","v":0},"22 max"]
[null,"ensilag herbe",{"$f":"IF(M109=0,\"\",50.2+0.128*M109-0.00008*M113)","v":{"$error":"#DIV/0!"}},null,null,"<50%MS",{"$f":"IF(M109=0,\"\",59.5+0.153*M109-0.0002*M113)","v":{"$error":"#DIV/0!"}},null,null,null,null,"pâteux-mou",65,26,{"$f":"IF($O$245=0,0,IF($O$245>=26,IF($O$245<32,M248,0),0))","v":0}]
[null,null,null,null,null,">50%MS",{"$f":"IF(M109=0,\"\",54.5+0.153*M109-0.0002*M113)","v":{"$error":"#DIV/0!"}},null,null,{"$f":"IF(B60=1,IF(Q245<=2,M247,M248),0)","v":70},null,"pâteux-dur",65,32,{"$f":"IF($O$245=0,0,IF($O$245>=32,M249,0))","v":0},{"$f":"AVERAGE(M246:M249)","v":67.5},{"$f":"IF(B60=1,IF(O245<22,70,65),0)","v":70}]
[null,"four. sec+ dzu",{"$f":"IF(M109=0,\"\",42+0.175*M109-0.00026*M113)","v":{"$error":"#DIV/0!"}},null,null,null,{"$f":"IF(M109=0,\"\",48.9+0.144*M109-0.0002*M113)","v":{"$error":"#DIV/0!"}},null,null,null,"ensilé","laiteux",72,22,{"$f":"IF($O$245=0,0,IF($O$245>=22,IF($O$245<26,M250,0),0))","v":0}]
[null,"DZU",null,null,null,null,{"$f":"IF(M109=0,\"\",51.9+0.092*M109-0.00015*M113)","v":{"$error":"#DIV/0!"}},null,null,null,null,"pâteux-mou",72,26,{"$f":"IF($O$245=0,0,IF($O$245>=26,IF($O$245<32,M251,0),0))","v":0}]
[null,"maïs PE",72,null,null,null,{"$f":"J244","v":70},null,null,{"$f":"IF(B60=2,72,0)","v":0},null,"pâteux-dur",72,32,{"$f":"IF($O$245=0,0,IF($O$245>=32,M252,0))","v":0},{"$f":"AVERAGE(M250:M252)","v":72}]
[null,null,null,null,null,null,null,null,null,null,"déshydraté","pâteux-mou",60,88]
["PF",{"$f":"IF(B60<>2,0,G9/F255)","v":0},{"$f":"IF(B60<>2,0,IF(M9>60,0,IF(B66=16,C256,C255)))","v":0},null,null,null,{"$f":"C254","v":0},null,null,{"$f":"IF(B60=4,60,0)","v":0},null,"pâteux-dur",60,88,{"$f":"IF(O245=0,0,P254)","v":0},{"$f":"AVERAGE(M253:M254)","v":60}]
[{"$f":"IF(J60<3,G254,C254)","v":0},"ens herb35MS",{"$f":"IF(OR(B60<>2,M9=\"\"),0,(205-(3*M9))/F255)","v":0},"p.rapport LV 99 divisé par ",null,{"$f":"IF(F60=1,2,1)","v":2}," /2"]
[null,"ens maïs30MS",{"$f":"IF(OR(B60<>2,M9=\"\"),0,(150-(2.5*M9))/F256)","v":0},"p.rapport LV 99 divisé par ",null,{"$f":"IF(F60=1,2,1)","v":2}," /2"]
[]
["dAAA",{"$f":"G11","v":""},{"$f":"IF(B66=16,C264,IF(B60=1,C259,IF(B60=2,C260,IF(B60=3,C262,IF(B60=4,C263,70)))))","v":{"$error":"#DIV/0!"}},null,{"$f":"ISERROR(B258)","v":false},null,{"$f":"IF(B66=16,G264,IF(B60=1,G259,IF(B60=2,H258,IF(B60=3,G262,IF(B60=4,G263,70)))))","v":{"$error":"#DIV/0!"}},{"$f":"IF(M9<50,G260,G261)","v":{"$error":"#DIV/0!"}}]
[{"$f":"IF(F60=1,G258,C258)","v":{"$error":"#DIV/0!"}},"herbe",{"$f":"IF(M109=0,\"\",66.1+0.104*M109-0.00006*M113)","v":{"$error":"#DIV/0!"}},null,null,null,{"$f":"IF(M109=0,\"\",65+0.132*M109-0.00014*M113)","v":{"$error":"#DIV/0!"}}]
[null,"ensilage h.",{"$f":"IF(M109=0,\"\",45.4+0.087*M109)","v":{"$error":"#DIV/0!"}},null,null,"<50%MS",{"$f":"IF(M109=0,\"\",62.8+0.138*M109-0.00016*M113)","v":{"$error":"#DIV/0!"}},null,null,null,null,"MS","amidon"]
[null,null,null,null,null,">50%MS",{"$f":"IF(M109=0,\"\",60.5+0.127*M109-0.00018*M113)","v":{"$error":"#DIV/0!"}},null,null,null,null,25,0]
[null,"fourr.secs",{"$f":"IF(M109=0,\"\",54.6+0.087*M109)","v":{"$error":"#DIV/0!"}},null,null,null,{"$f":"IF(M109=0,\"\",58.5+0.127*M109-0.00018*M113)","v":{"$error":"#DIV/0!"}}]
[null,"dzu",{"$f":"IF(M109=0,\"\",54.6+0.087*M109)","v":{"$error":"#DIV/0!"}},null,null,null,{"$f":"IF(M109=0,\"\",56.4+0.141*M109-0.00023*M113)","v":{"$error":"#DIV/0!"}}]
[null,"maïs PE",70,null,null,null,72]
[null,null,null,null,null,null,null,null,null,{"$f":"IF(F60=2,0,IF(O266<O267,0,IF(B66=16,SUM(J267:J269),0)))","v":0},"Maïs correction LV06  amidon à la MOF"]
["MOF",null,{"$f":"(J115*(G18/100))-(J109*(1-B246/100))-J114-B254-J265","v":{"$error":"#VALUE!"}},null,null,null,{"$f":"ISERROR(C266)","v":true},null,null,null,"Etat","amidon","deAMI","déductions",{"$f":"IF(B60=4,IF(M9=\"\",88,M9),M9)","v":0},"MS (88)  par défaut pour DZU si rien donné"]
["PAIE",null,{"$f":"((0.093*C266)+J109*(1.11*(1-B246/100))*(B258/100))*G2/100","v":{"$error":"#VALUE!"}},null,null,null,{"$f":"ISERROR(C267)","v":true},null,null,{"$f":"IF(B60=1,N267,0)","v":0},"vert",{"$f":"IF(G16=\"\",0,G16)","v":0},60,{"$f":"L267*(1-M267/100)","v":0},22,"MS limite pour tenir compte de la correction"]
["PAIN",null,{"$f":"(J109*(B246/100-0.1)*0.64+J109*(1.11*(1-B246/100))*B258/100)*G2/100","v":{"$error":"#VALUE!"}},null,null,null,true,null,null,{"$f":"IF(B60=2,N268,0)","v":0},"ensilé",{"$f":"IF(G16=\"\",0,G16)","v":0},70,{"$f":"L268*(1-M268/100)","v":0}]
["PAIMN",null,{"$f":"(J109*(B246/100-0.1)*0.64)*G2/100","v":{"$error":"#VALUE!"}},null,null,null,true,null,null,{"$f":"IF(B60=4,N269,0)","v":0},"déshydraté",{"$f":"IF(G16=\"\",0,G16)","v":0},50,{"$f":"L269*(1-M269/100)","v":0}]
["PMN",null,{"$f":"(J109*(1-(1.11*(1-B246/100))))*G2/100","v":{"$error":"#VALUE!"}},null,null,null,true]
["PME",null,{"$f":"(0.145*C266)*G2/100","v":{"$error":"#VALUE!"}},null,null,null,true]
["PAIA",null,{"$f":"(J109*(1.11*(1-B246/100))*B258/100)*G2/100","v":{"$error":"#VALUE!"}},null,null,null,true,null,null,{"$f":"IF(M9>=20,IF(M9<=30,22.571*M9-382.62,315),0)","v":0},"Teneur en amidon, source wyu"]
[null,null,null,null,null,null,null,null,null,null,"MS","Amidon"]
[null,null,null,null,null,null,null,null,null,null,14,0]
["PPL avec entretrien",null,"NEL","PAIE","PAIN",null,null,null,null,null,16,0,0]
["MSI",19,40.5,409,409,null,null,null,null,null,18,1]
["par kg MSI",null,{"$f":"C276/B276","v":2.1315789473684212},{"$f":"D276/B276","v":21.526315789473685},{"$f":"E276/B276","v":21.526315789473685},null,null,null,null,null,20,65]
["apport",null,{"$f":"C239","v":{"$error":"#VALUE!"}},{"$f":"C267","v":{"$error":"#VALUE!"}},{"$f":"C268","v":{"$error":"#VALUE!"}},null,null,null,null,null,22,115]
["solde production",null,{"$f":"C278-C277","v":{"$error":"#VALUE!"}},{"$f":"D278-D277","v":{"$error":"#VALUE!"}},{"$f":"E278-E277","v":{"$error":"#VALUE!"}},null,null,null,null,null,24,160,"y = 22.571x - 382.62"]
["PPL par kg MS avec entretrien",null,{"$f":"C279/3.14","v":{"$error":"#VALUE!"}},{"$f":"D279/50","v":{"$error":"#VALUE!"}},{"$f":"E279/50","v":{"$error":"#VALUE!"}},null,null,null,null,null,26,210,"R2 = 0.998"]
[null,null,null,null,null,null,null,null,null,null,28,250]
[{"$f":"CONCATENATE(\"PPL pour MSI \",B276,\"kg MS\")","v":"PPL pour MSI 19kg MS"},null,{"$f":"C280*19","v":{"$error":"#VALUE!"}},{"$f":"D280*B276","v":{"$error":"#VALUE!"}},{"$f":"E280*B276","v":{"$error":"#VALUE!"}},null,null,null,null,null,30,290]
[null,null,null,null,null,null,null,null,null,null,32,310]
[null,null,null,null,null,null,null,null,null,null,34,328]
[null,null,null,null,null,null,null,null,null,null,36,335,315]
[null,null,null,null,null,null,null,null,null,null,38,345]
[null,null,null,null,null,null,null,null,null,null,40,355]
[]
[]
[]
[]
[]
[]
[]
[]
[]
[null,"J","K","L"]
[true,"pas d'équation"]

{"sheet":"Einführung","index":2,"n_rows":139,"n_cols":17,"rows_kept":139,"cut":false,"hidden":false,"merged":[[48,7,53,7],[58,7,74,7],[93,1,105,1],[109,1,128,1],[130,5,130,13]]}
["Berechnungsweise GRÜNES BUCH 2006",null,null,null,null,"Y.Arrigo Agroscope CH-1725 Posieux,      E-mail:   yves.arrigo@agroscope.admin.ch"]
[null,null,null,null,null,null,null,null,null,null,null,null,null,null,null,"Gräser","Grünfutter"]
["Anwendung, Bemerkungen und Warnungen"]
["Die Berechnungsweise nimmt Bezug auf die Kapitel 13 und 15 des Grünen Buchs, Ausgabe 2017, auf welche der Zugriff auf der Website www.agroscope frei per Anmeldung erfolgen kann. ",null,null,null,null,null,null,null,null,null,null,null,null,null,null,"G.Ray-grass","Silagen"]
[null,null,null,null,null,null,null,null,null,null,null,null,null,null,null,"Ausgewogene","Dürrfutter"]
["Die Überschreitungen des Anwendungsbereichs werden angezeigt.",null,null,null,null,null,null,null,null,null,null,null,null,null,null,"Ausgew.Ray-grass","künst.getrocknet"]
["Wenn die Werte für NEL, NEV, APDE, APDN nicht erscheinen, liegt dies daran, dass die Daten unvollständig sind oder keine Regressionen für die Schätzung der vOS dieser Futterart existieren.",null,null,null,null,null,null,null,null,null,null,null,null,null,null,"Leguminosen"]
[null,null,null,null,null,null,null,null,null,null,null,null,null,null,null,"Kräuter feinblättrige"]
[null,null,null,null,null,null,null,null,null,null,null,null,null,null,null,"Kräuter grobständelige"]
["Die Taste",null,"löscht die Daten in den Zellen, lässt die Funktionen der standardmässigen Vorgabe wieder erscheinen und annulliert alle Optionen, verändert aber die letzte Wahl des Mausklick-Menüs nicht.",null,null,null,null,null,null,null,null,null,null,null,null,"Unbekannter Best.","Schätzung vOS mit RF GB06"]
[null,null,null,null,null,null,null,null,null,null,null,null,null,null,null,"Knaulgras","Schätzung vOS mit ADF GB06"]
[null,null,null,null,null,null,null,null,null,null,null,null,null,null,null,"Italienisches Ray-grass"]
[null,null,null,null,null,null,null,null,null,null,null,null,null,null,null,"Wiesenfuchsschwanz"]
["Sie verfügen über Mausklick-Menüs für die Wahl der Futterkonserven, ",null,null,null,null,null,null,null,null,null,null,null,null,null,null,"Weissklee","Blüte"]
["der botanischen Zusammensetzung und des Schätzschlüssels der vOS (über RF oder ADF)",null,null,null,null,null,null,null,null,null,null,null,null,null,null,"Rotklee","Milchreife"]
["Diese Auswahl wird in der Druckversion der Ergebnisse markiert.",null,null,null,null,null,null,null,null,null,null,null,null,null,null,"Luzern","Beginn Teigreife"]
[null,null,null,null,null,null,null,null,null,null,null,null,null,null,null,"Maïs","Teigreife"]
[]
[]
[]
["Die Daten (RP, RF, RA und falls bekannt ADF, NDF, vOS, vRP) sind in den dafür vorgesehenen grauen und dunkelblauen Zellen einzugeben.",null,null,null,null,null,null,null,null,"TS",100]
["Die standardmässig vorgegebenen Daten werden in den blauen Zellen vorgeschlagen. ",null,null,null,null,null,null,null,null,"RP"]
["Sie können durch bekannte Werte ersetzt werden. Dann ist jedoch eine Initialisierung erforderlich, ",null,null,null,null,null,null,null,null,"RF"]
["um die Ausgangsformel für eine Neuberechnung wieder zu finden.",null,null,null,null,null,null,null,null,"RA",null,"Bei Silagen und Maïs ist die TS in der Zelle rechts neben dem Rahmen einzutragen. "]
["Generell wird mit g/kg TS gearbeitet und die Resultate werden in Einheiten/kg TS angegeben. ",null,null,null,null,null,null,null,null,"ADF",null,"Sie ist für die Berechnung vergärter Produkte und Stärke erforderlich."]
["Liegen die Werte in FS vor, ist die effektive TS anzugeben und die Ergebnisse erscheinen in Einheiten/kg. ",null,null,null,null,null,null,null,null,"NDF",null,null,null,"% TS Silage und Maïs (Stärkeschätzung)"]
[null,null,null,null,null,null,null,null,null,"RL",{"$f":"IF(K21=\"\",\"\",IF(K22=\"\",\"\",0.35*K21))","v":""}]
[]
[]
[]
[]
["Um die aRP von Grünmais zu definieren, ist ein vorgeschlagener Reifegrad zu wählen."]
[]
["die Verdaulichkeit der organischen Substanz (vOS)  von Mais kann auf zwei Arten geschätzt werden:"]
["1. über die Korrektur der VOS, die mit der vOS Ausgabe Grünes Buch 2006 gerechnet wurde, oder "]
["2. über die neue Regressionsgleichung auf der Basis von ADF und NDF (Analyse van Soest). Diese wurde an der ALP-Tagung 2012 erstmals vorgestellt und in der Agrarforschung bzw."]
["Revue agronomique suisse Sept. 2012 veröffentlicht."]
["Falls keine ADF-NDF-Analysen vorliegen, dann wählen Sie \"Mais GB06 korrigiert\". "]
["Sind ADF-NDF vorhanden, dann wählen sie für Mais ganze Pflanze \"Mais ALP12 für GP\"; "]
["Sind ADF-NDF vorhanden bei Teilernten (Hochschnitt, nur Stängel, mit Kolben angereichert) ist die Gleichung \"Mais ALP12 nicht GP\" zu benutzen."]
[]
[]
[]
["Die Ergebnisse erscheinen in Rot. Für die vOS wird links ein durch Regression ",null,null,null,null,null,null,71.819753086419752,"vOS",76.819753086419752,"%"]
["erhaltener Richtwert der vOS ohne Korrekturen angegeben."]
[]
["Bei fehlenden Informationen können Bemerkungen erscheinen."]
["Sobald der Anwendungsbereich überschritten wird, verlieren die Ergebnisse ihre Gültigkeit."]
[]
[]
[]
[]
[]
[]
[]
[]
[]
[]
["vOS muss mit Hilfe vom Aufwuchs und Stadium (beide anklicken) korrigiert werden"]
["Für unbekannte Mischungen wurden neue Korrekturen miteinbeziehen"]
["Sie wurden zusammen aus den Korrekturen von den Mischungen und reinen Pflanzen gebildet."]
["Für alle Raufutter falls Stadium fehlt wird die vOS Korrektur nach Aufwuchs (1. oder folgende) "]
["und Konserve-Type gebildet:"]
["für Grün, Silage und künstlich getrocknete Raufutter gilt die Durchschnitte der Stadien 2 und 3."]
["für Dürfutter die Durchschnitte der Korreturen der Stadien 3 und 4."]
["Die abgerundeten Durschnitte werden bei der vOS angewendet.  "]
[]
[]
["Korrekturoptionen für Silagen, Heu- und Emd werden vorgeschlagen.  "]
["Diese werden nicht bei analysierten Werten verwendet, da die Abzüge bereits inbegriffen sind."]
[]
[]
[]
[]
["Sobald eine Korrektur aktiviert ist, wird diese bei den Ergebnissen angegeben."]
[]
[]
[]
[null,null,null,null,null,null,null,null,"Erster Aufwuchs",null,null,"Weitere Aufwüchse"]
["Korrekturen für unbestimmte Mischbestände und andere Raufutter",null,null,null,null,null,null,null,"Stadium 2","Stadium 3","Stadium 4","Stadium 2","Stadium 3","Stadium 4"]
[null,null,null,null,null,null,null,null,4.83,4.66,4.38,-2.75,-3.77,-3.06]
["falls das Stadium fehlt schätz das Programm die "]
["Korrektur nach dem Typ des Futters:",null,null,null,"Grünfutter",null,"Durchschnitt der Stadien 2 und 3",null,null,4.623333333333334,null,null,-3.1933333333333334]
[null,null,null,null,"Silagen",null,"Durchschnitt der Stadien 2 und 3",null,null,4.83,null,null,-2.75]
[null,null,null,null,"Dürrfutter",null,"Durchschnitt der Stadien 3 und 4",null,null,4.5199999999999996,null,null,-3.415]
[null,null,null,null,"künstl. getrocknet",null,"Durchschnitt der Stadien 2 und 3",null,null,4.7450000000000001,null,null,-3.26]
[]
["Um Tinte zu sparen, werden die Ergebnisse auf neutralem Papier (ohne Hintergrund) gedruckt."]
["Die in den Ergebnissen angezeigten Werte für ADF, NDF und Zucker sind Richtwerte, die aus groben Schätzungen hervorgehen. Sie basieren auf den Werten, die in den Tabellen angegebenen werden. "]
["Mit ihnen lassen sich keine sicheren Vorhersagen über die Zellwandbestandteile ausgehend von der RF treffen."]
[]
[]
[]
[]
[]
[]
[]
[]
[]
[]
[]
[]
[]
[]
[]
[]
[]
[]
[]
[]
[]
[]
[]
[]
[]
[]
[]
[]
[]
[]
[]
[]
[]
[]
[]
[]
[]
[]
[]
[]
[]
[]
[]
[]
[]
[]
[]
[null,null,null,null,null,null,null,null,null,null,null,null,null,null,null,0]
[null,null,null,null,null,null,null,null,null,null,null,null,null,null,null,0]

{"sheet":"Futterw. Raufutter 2017","index":3,"n_rows":298,"n_cols":57,"rows_kept":298,"cut":false,"hidden":false,"merged":[[40,4,56,4],[84,14,84,23],[0,20,35,20],[1,0,5,0],[1,4,13,4],[1,25,13,25],[7,0,15,0],[17,0,21,0],[17,25,36,25],[18,4,36,4],[23,0,31,0]]}
[null,"Das Grüne Buch 2006 (GB06) ",null,null,null,null,"Frei für Referenz",null,null,null,null,null,null,null,null,null,null,null,null,null,"cellules utilisée par la macro pour initialiser la feuille de calcul",null,"Frei für Referenz",null,null,null,"Futter:",{"$f":"INDEX(A61:A64,B60)","v":"Grünfutter"},{"$f":"IF(G1=\"\",\"\",G1)","v":"Frei für Referenz"},{"$f":"INDEX(A67:A82,B66)","v":"Gräser"}]
["RAUFUTTER","Version 6.6.2017 neue Korr.vOS unb. Bestand+ unb.Stadium",null,null,"DATEN","TS",100,"%",{"$f":"IF($B$88=TRUE,A89,\"\")","v":"Trockensubstanzgehalt, 100 wenn die Gehalte in der TS angegeben werden"},null,null,null,null,null,null,null,null,null,null,null,null,null,100,null,null,"DATEN",{"$f":"F2","v":"TS"},100,"%","Trockensubstanzgehalt, 100 wenn die Gehalte in der TS angegeben werden"]
[null,null,null,null,null,"RP",null,{"$f":"IF($G$2=100,\"g/kg TS\",\"g/kg\")","v":"g/kg TS"},"Rohprotein",null,null,null,null,null,null,null,null,null,"  ",null,null,null,null,null,null,null,"RP",{"$f":"IF(G3=\"\",\"\",G3)","v":""},"g/kg TS","Rohprotein"]
[null,null,null,null,null,"RF",null,{"$f":"IF($G$2=100,\"g/kg TS\",\"g/kg\")","v":"g/kg TS"},"Rohfaser",null,null,null,null,null,null,null,null,null,null,null,null,null,null,null,null,null,"RF","","g/kg TS","Rohfaser"]
[null,null,null,null,null,"RA",null,{"$f":"IF($G$2=100,\"g/kg TS\",\"g/kg\")","v":"g/kg TS"},"Rohasche",null,null,null,null,null,null,null,null,null,null,null,null,null,null,null,null,null,"RA","","g/kg TS","Rohasche"]
[null,null,null,"  ",null,"ADF",null,{"$f":"IF($G$2=100,\"g/kg TS *\",\"g/kg *\")","v":"g/kg TS *"},"Lignozellulose (ADF)",null,null,null,null,null,null,null,null,null,null,null,null,null,null,null,null,null,"ADF","","g/kg TS *","Lignozellulose (ADF)"]
[null,null,null,null,null,"NDF",null,{"$f":"IF($G$2=100,\"g/kg TS *\",\"g/kg *\")","v":"g/kg TS *"},"Zellwände (NDF)",null,null,null,null,null,null,null,null,null,null,null,null,null,null,null,null,null,"NDF","","g/kg TS *","Zellwände (NDF)"]
["BESTANDESTYP",null,null,null,null,"RL",{"$f":"IF(G2=\"\",\"\",IF(G3=\"\",\"\",0.35*G2))","v":""},{"$f":"IF($G$2=100,\"g/kg TS *\",\"g/kg *\")","v":"g/kg TS *"},"Rohfett (Rohlipide)",null,null,null,null,null,null,null,null,null,null,null,null,null,{"$f":"IF(W2=\"\",\"\",IF(W3=\"\",\"\",0.35*W2))","v":""},null,null,null,"RL","","g/kg TS *","Rohfett (Rohlipide)"]
[null,null,null,null,null,"FP",{"$f":"IF(G2=\"\",\"\",IF(G3=\"\",\"\",IF(B60<>2,0,A255*F255)))","v":""},{"$f":"IF($G$2=100,\"g/kg TS *\",\"g/kg *\")","v":"g/kg TS *"},"Fermentationsprodukte der Silagen % TS angeben >  >  >",null,null,null,35,"% TS Silage und Maïs (Stärkeschätzung)",null,null,null,null,null,null,null,null,{"$f":"IF(W2=\"\",\"\",IF(W3=\"\",\"\",IF(R60<>2,0,Q255*V255)))","v":""},null,null,null,"FP","",{"$f":"H9","v":"g/kg TS *"},{"$f":"CONCATENATE(\"Fermentationsprodukte der Silagen \",IF(M9=\"\",\"\",M9),\" % TS \")","v":"Fermentationsprodukte der Silagen 35 % TS "}]
[null,null,null,null,null,"aRP",{"$f":"IF(G2=\"\",\"\",IF(G3=\"\",\"\",IF(G5=\"\",\"\",A247)))","v":""},"% *","Abbaubarkeit des Rohproteins",null,null,null,null,null,null,null,null,null,null,null,null,null,{"$f":"IF(W2=\"\",\"\",IF(W3=\"\",\"\",IF(W5=\"\",\"\",Q247)))","v":""},null,null,null,"aRP","",{"$f":"H10","v":"% *"},{"$f":"I10","v":"Abbaubarkeit des Rohproteins"}]
[null,null,null,null,null,"vASF",{"$f":"IF(G2=\"\",\"\",IF(G3=\"\",\"\",IF(G5=\"\",\"\",A259)))","v":""},"% *","Verdaulichkeit der aus dem Futter stammenden Aminosäuren",null,null,null,null,null,null,null,null,null,null,null,null,null,{"$f":"IF(W2=\"\",\"\",IF(W3=\"\",\"\",IF(W5=\"\",\"\",Q259)))","v":""},null,null,null,"vASF","",{"$f":"H11","v":"% *"},{"$f":"I11","v":"Verdaulichkeit der aus dem Futter stammenden Aminosäuren"}]
[]
[null,null,null,null,null,"vOS",{"$f":"IF(G2=\"\",\"\",IF(G5=\"\",\"\",IF(AA145=0,\"\",AA145)))","v":""},"% *",{"$f":"IF($B$88=TRUE,A99,\"\")","v":"Verdaulichkeit der Organischen Substanz (Daten in vivo oder Tabelle GB06, Korrekturen Aufwuchs und Stadium ausschalten!)"},null,null,null,null,null,null,null,null,null,null,null,null,null,{"$f":"IF(W2=\"\",\"\",IF(W5=\"\",\"\",IF(AQ145=0,\"\",AQ145)))","v":""},null,null,null,{"$f":"F13","v":"vOS"},{"$f":"IF(G13=\"\",\"\",G13)","v":""},{"$f":"H13","v":"% *"},{"$f":"I13","v":"Verdaulichkeit der Organischen Substanz (Daten in vivo oder Tabelle GB06, Korrekturen Aufwuchs und Stadium ausschalten!)"}]
[null,null,null,null,null,"vRP",null,"%*",{"$f":"IF($B$88=TRUE,A100,\"\")","v":"Verdaulichkeit des Rohprotein (Daten in vivo oder Tabelle GB06)"},null,null,null,null,null,null,null,null,null,null,null,null,null,null,null,null,null,{"$f":"F14","v":"vRP"},{"$f":"IF(G14=\"\",\"\",G14)","v":""},{"$f":"H14","v":"%*"},{"$f":"I14","v":"Verdaulichkeit des Rohprotein (Daten in vivo oder Tabelle GB06)"}]
[]
[null,{"$f":"INDEX(C67:C82,B66)","v":">70% Gräser"},null,null,null,"Stärke",{"$f":"IF(B66=16,IF(G2=\"\",\"\",IF(G3=\"\",\"\",IF(M9<20,0,IF(M9<=30,22.571*M9-382.62,315)))),\"\")","v":""},{"$f":"IF($G$2=100,\"g/kg TS *\",\"g/kg *\")","v":"g/kg TS *"},{"$f":"IF($B$88=TRUE,A120,\"\")","v":"* Standardeinstellung, andere Daten können engefügt werden, dann braucht es ein Zurücksetzen für weitere Berchnungen"},null,null,null,null,null,null,null,null,null,null,null,null,null,{"$f":"IF(R66=16,IF(W2=\"\",\"\",IF(W3=\"\",\"\",IF(AC9<20,0,IF(AC9<=30,22.571*AC9-382.62,315)))),\"\")","v":""},{"$f":"INDEX(X18:X21,B60)","v":"Grünfutter"},{"$f":"C66","v":"G"},null,{"$f":"IF(AB18=\"\",\"\",IF(P121=1,\"vOS nicht korrigiert !\",IF(P122=1,CONCATENATE(\"vOS korrigiert nach Aufwuchs \",P121-1,\" und Art des Futters, da Stadium fehlt\"),CONCATENATE(\"vOS korrigiert nach Aufwuchs: \",P121-1,\" und Stadium \",P122))))","v":""},null,null,{"$f":"IF(AND(B60=3,B66=16),\"keine Gleichung für diese Raufuttertyp\",CONCATENATE(K60,\" für Raufutter: \",X16,\"; Typ: \",P67))","v":"Schätzung vOS mit RF GB06 für Raufutter: Grünfutter; Typ: G"}]
[null,null,null,null,null," ",null,null,null,null,null,null,null,null,null,null,null,null,null,null,null,null,null,null,null,null,"résultats"]
["OPTIONEN GB",null,null,null,{"$f":"IF(G18=\"\",\"\",IF(AA145=0,\"\",AA145))","v":""},"vOS",{"$f":"IF(G85=1,\"\",IF(G2=\"\",\"\",IF(G3=\"\",\"\",IF(AD145=0,\"\",IF(AD145=\"\",\"\",AD145)))))","v":""},"%",{"$f":"IF($B$88=TRUE,A101,\"\")","v":"Verdaulichkeit der OS ( gegeben), benutzt für die Berechnung"},null,null,null,null,null,null,null,null,null,null,null,null,null,{"$f":"IF(W85=1,\"\",IF(W2=\"\",\"\",IF(W3=\"\",\"\",IF(AT145=0,\"\",IF(AT145=\"\",\"\",AT145)))))","v":""},"Grünfutter",null,"BERECHNETE RESULTATE",{"$f":"F18","v":"vOS"},{"$f":"IF(G18=\"\",\"\",G18)","v":""},{"$f":"H18","v":"%"},"Verdaulichkeit der OS ( gegeben), benutzt für die Berechnung"]
[null,null,null,null,"    ERGEBNISSE","vRP",{"$f":"IF(G18=\"\",\"\",IF(G227=TRUE,\"\",IF(G2=\"\",\"\",F227)))","v":""},"%","Verdaulichkeit des RP (aus Gleichung ), benutzt für die Berechnung",null,null,null,null,null,null,null,null,null,null,null,null,null,{"$f":"IF(W18=\"\",\"\",IF(W227=TRUE,\"\",IF(W2=\"\",\"\",V227)))","v":""},"Silagen",null,null,"vRP","","%","Verdaulichkeit des RP (aus Gleichung ), benutzt für die Berechnung"]
[null,null,null,null,null,"NEL",{"$f":"IF(G18=\"\",\"\",IF(G239=TRUE,\"\",IF(G2=\"\",\"\",C239+C239*J140)))","v":""},{"$f":"IF($G$2=100,\"MJ/kg MS\",\"MJ/kg\")","v":"MJ/kg MS"},"Nettoenergie Milch",null,null,null,null,null,null,null,null,null,null,null,null,null,{"$f":"IF(W18=\"\",\"\",IF(W239=TRUE,\"\",IF(W2=\"\",\"\",S239+S239*Z140)))","v":""},"Dürrfutter",null,null,"NEL","","MJ/kg MS","Nettoenergie Milch"]
[null,null,null,null,null,"NEV",{"$f":"IF(G18=\"\",\"\",IF(G240=TRUE,\"\",IF(G2=\"\",\"\",C240+C240*K140)))","v":""},{"$f":"IF($G$2=100,\"MJ/kg MS\",\"MJ/kg\")","v":"MJ/kg MS"},"Nettoenergie Mast",null,null,null,null,null,null,null,null,null,null,null,null,null,{"$f":"IF(W18=\"\",\"\",IF(W240=TRUE,\"\",IF(W2=\"\",\"\",S240+S240*AA140)))","v":""},"künstlich getrocknet",null,null,"NEV","","MJ/kg MS","Nettoenergie Mast"]
[null,null,null,null,null,"APDE",{"$f":"IF(G18=\"\",\"\",IF(G267=TRUE,\"\",IF(G2=\"\",\"\",C267+C267*L140)))","v":""},{"$f":"IF($G$2=100,\"g/kg TS\",\"g/kg\")","v":"g/kg TS"},"Absorbierbares Protein im Darm, das auf Grund der verfügbaren Energiemenge aufgebaut werden kann (aRP/vASF  GB06)",null,null,null,null,null,null,null,null,null,null,null,null,null,{"$f":"IF(W18=\"\",\"\",IF(W267=TRUE,\"\",IF(W2=\"\",\"\",S267+S267*AB140)))","v":""},null,null,null,"APDE","","g/kg TS","Absorbierbares Protein im Darm, das auf Grund der verfügbaren Energiemenge aufgebaut werden kann (aRP/vASF  GB06)"]
[null,{"$f":"IF(G2=\"\",\"\",IF(B66=16,\"  Stadium MAIS und TS\",\"\"))","v":""},null,null,null,"APDN",{"$f":"IF(G18=\"\",\"\",IF(G268=TRUE,\"\",IF(G2=\"\",\"\",IF(C268=0,\"\",C268+C268*M140))))","v":""},"g/kg TS","Absorbierbares Protein im Darm, das auf Grund des abgebauten Rohproteins aufgebaut werden kann (aRP/vASF  GB06)",null,null,null,null,null,null,null,null,null,null,null,null,null,{"$f":"IF(W18=\"\",\"\",IF(W268=TRUE,\"\",IF(W2=\"\",\"\",IF(S268=0,\"\",S268+S268*AC140))))","v":""},null,null,null,"APDN","","g/kg TS","Absorbierbares Protein im Darm, das auf Grund des abgebauten Rohproteins aufgebaut werden kann (aRP/vASF  GB06)"]
["BEMERKUNGEN",{"$f":"H65","v":""},{"$f":"IF(B66=16,IF(G84=1,\" fehlt RF, ADF oder NDF\",\"\"),\"\")","v":""},null,null,"PME",{"$f":"IF(G18=\"\",\"\",IF(G2=\"\",\"\",IF(G271=TRUE,\"\",C271)))","v":""},"g/kg TS",{"$f":"IF($B$88=TRUE,A108,\"\")","v":"Menge Mikroorganismen-Protein, das aus der fermentierbaren Energie aufgebaut werden kann"},null,null,null,null,null,null,null,null,null,null,null,null,null,{"$f":"IF(W18=\"\",\"\",IF(W2=\"\",\"\",IF(W271=TRUE,\"\",S271)))","v":""},null,null,null,{"$f":"F26","v":"APDMN"},{"$f":"IF(G26=\"\",\"\",G26)","v":""},{"$f":"H26","v":"g/kg TS"},{"$f":"I26","v":"Absorbierbares Protein im Darm, das aus dem abbaubaren Rohprotein aufgebaut werden kann"}]
[null,{"$f":"IF(G2=\"\",\"\",IF(B60=2,IF(M9=\"\",\"TS DER SILAGE EINGEBEN !\",\"\"),\"\"))","v":""},null,null,null,"PMN",{"$f":"IF(G18=\"\",\"\",IF(G270=TRUE,\"\",IF(G2=\"\",\"\",IF(C270=0,\"\",C270))))","v":""},"g/kg TS",{"$f":"IF($B$88=TRUE,A109,\"\")","v":"Menge Mikroorganismen-Protein, das aus dem abbaubaren Rohprotein aufgebaut werden kann"},null,null,null,null,null,null,null,null,null,null,null,null,null,{"$f":"IF(W18=\"\",\"\",IF(W270=TRUE,\"\",IF(W2=\"\",\"\",IF(S270=0,\"\",S270))))","v":""},null,null,null,{"$f":"F24","v":"PME"},{"$f":"IF(G24=\"\",\"\",G24)","v":""},{"$f":"H24","v":"g/kg TS"},{"$f":"I24","v":"Menge Mikroorganismen-Protein, das aus der fermentierbaren Energie aufgebaut werden kann"}]
[null,{"$f":"IFERROR(IF(G37=\"\",\"\",IF(G2=\"\",\"\",IF(G3=\"\",\"\",IF(G37>30,\"PROTEINUEBERSCHUSS !\",\"\")))),\"\")","v":""},null,null,null,"APDMN",{"$f":"IF(G18=\"\",\"\",IF(G2=\"\",\"\",IF(G269=TRUE,\"\",IF(C269=0,\"\",C269))))","v":""},"g/kg TS",{"$f":"IF($B$88=TRUE,A107,\"\")","v":"Absorbierbares Protein im Darm, das aus dem abbaubaren Rohprotein aufgebaut werden kann"},null,null,null,null,null,null,null,null,null,null,null,null,null,{"$f":"IF(W18=\"\",\"\",IF(W2=\"\",\"\",IF(W269=TRUE,\"\",IF(S269=0,\"\",S269))))","v":""},null,null,null,{"$f":"F25","v":"PMN"},{"$f":"IF(G25=\"\",\"\",G25)","v":""},{"$f":"H25","v":"g/kg TS"},{"$f":"I25","v":"Menge Mikroorganismen-Protein, das aus dem abbaubaren Rohprotein aufgebaut werden kann"}]
[null,{"$f":"IF(G2=\"\",\"\",IF(G3=\"\",\"\",O109))","v":""},null,null,null,"APDF",{"$f":"IF(G18=\"\",\"\",IF(G2=\"\",\"\",IF(G272=TRUE,\"\",IF(C272=0,\"\",C272))))","v":""},"g/kg TS",{"$f":"IF($B$88=TRUE,A110,\"\")","v":"Absorbierbares Protein im Darm aus dem Futter"},null,null,null,null,null,null,null,null,null,null,null,null,null,{"$f":"IF(W18=\"\",\"\",IF(W2=\"\",\"\",IF(W272=TRUE,\"\",IF(S272=0,\"\",S272))))","v":""},null,null,null,{"$f":"F27","v":"APDF"},{"$f":"IF(G27=\"\",\"\",G27)","v":""},{"$f":"H27","v":"g/kg TS"},"Absorbierbares Protein im Darm aus dem Futter"]
[null,{"$f":"IF(G2=\"\",\"\",IF(G4=\"\",\"\",O110))","v":""},"  ",null,null,"APDM",{"$f":"IF(G18=\"\",\"\",IF(G266=TRUE,\"\",IF(G2=\"\",\"\",0.093*(C266*G2/100))))","v":""},"g/kg TS","Mikrobielles absorbierbares Protein im Darm (FOS x 0.093)",null,null,null,null,null,null,null,null,null,null,null,null,null,{"$f":"IF(W18=\"\",\"\",IF(W266=TRUE,\"\",IF(W2=\"\",\"\",0.093*(S266*W2/100))))","v":""},null,null,null,"APDM","","g/kg TS","Mikrobielles absorbierbares Protein im Darm (FOS x 0.093)"]
[null,{"$f":"IF(G2=\"\",\"\",IF(G6=\"\",\"\",O112))","v":""},null,null,null,"UE",{"$f":"IF(G18=\"\",\"\",IF(G220=TRUE,\"\",IF(G2=\"\",\"\",B220)))","v":""},{"$f":"IF($G$2=100,\"MJ/kg MS\",\"g/kg\")","v":"MJ/kg MS"},"Umsetzbare Energie",null,null,null,null,null,null,null,null,null,null,null,null,null,{"$f":"IF(W18=\"\",\"\",IF(W220=TRUE,\"\",IF(W2=\"\",\"\",R220)))","v":""},null,null,null,"UE","","MJ/kg MS","Umsetzbare Energie"]
[null,{"$f":"IFERROR(IF(G18=\"\",\"\",IF(AD145=\"\",\"\",IF(AD145=0,\"\",O114))),\"\")","v":""},null,null,null,"ADF",{"$f":"IF(G2=\"\",\"\",IF(G6=\"\",IF(AF145=0,\"\",AF145),G6))","v":""},{"$f":"IF($G$2=100,\"g/kg TS\",\"g/kg\")","v":"g/kg TS"},"Orientierungswert für Lignozellulose (ADF) aus Gleichung Basis RF und botanische Zus.",null,null,null,null,null,null,null,null,null,null,null,null,null,{"$f":"IF(W2=\"\",\"\",IF(W6=\"\",IF(AV145=0,\"\",AV145),W6))","v":""},null,null,null,"ADF","","g/kg TS","Orientierungswert für Lignozellulose (ADF) aus Gleichung Basis RF und botanische Zus."]
[null,{"$f":"S63","v":""},null,null,null,"NDF",{"$f":"IF(G2=\"\",\"\",IF(G7=\"\",IF(AH145=0,\"\",AH145),G7))","v":""},{"$f":"IF($G$2=100,\"g/kg TS\",\"g/kg\")","v":"g/kg TS"},"Orientierungswert für Zellwände (NDF) aus Gleichung Basis RF und botanische Zus.",null,null,null,null,null,null,null,null,null,null,null,null,null,{"$f":"IF(W2=\"\",\"\",IF(W7=\"\",IF(AX145=0,\"\",AX145),W7))","v":""},null,null,null,"NDF","","g/kg TS","Orientierungswert für Zellwände (NDF) aus Gleichung Basis RF und botanische Zus."]
[null,{"$f":"S62","v":""},null,null,null,"ZUCKER",{"$f":"IF(G2=\"\",\"\",IF(G4=\"\",\"\",IF(AJ145=0,\"\",AJ145)))","v":""},{"$f":"IF($G$2=100,\"g/kg TS\",\"g/kg\")","v":"g/kg TS"},"Orientierungswert für Zucker aus Gleichung Basis RF und botanische Zus.",null,null,null,null,null,null,null,null,null,null,null,null,null,{"$f":"IF(W2=\"\",\"\",IF(W4=\"\",\"\",IF(AZ145=0,\"\",AZ145)))","v":""},null,null,null,"ZUCKER","","g/kg TS","Orientierungswert für Zucker aus Gleichung Basis RF und botanische Zus."]
[]
[null,null,null,null,null,"MPP NEL",{"$f":"IF(G2=\"\",\"\",IF(G20=\"\",\"\",G20/3.14))","v":""},"kg Milch",{"$f":"IF($B$88=TRUE,A116,\"\")","v":"Milchproduktionspotenzial nach NEL pro kg TS (NEL/3.14)"},null,null,null,null,null,null,null,null,null,null,null,null,null,{"$f":"IF(W2=\"\",\"\",IF(W20=\"\",\"\",W20/3.14))","v":""},null,null,null,{"$f":"F34","v":"MPP NEL"},{"$f":"IF(G34=\"\",\"\",G34)","v":""},{"$f":"H34","v":"kg Milch"},"Milchproduktionspotenzial nach NEL pro kg TS (NEL/3.14)"]
[null,null,null,null,null,"MPP APDE",{"$f":"IF(G2=\"\",\"\",IF(G22=\"\",\"\",G22/50))","v":""},"kg Milch",{"$f":"IF($B$88=TRUE,A117,\"\")","v":"Milchproduktionspotenzial nach APDE pro kg TS (APDE/50)"},null,null,null,null,null,null,null,null,null,null,null,null,null,{"$f":"IF(W2=\"\",\"\",IF(W22=\"\",\"\",W22/50))","v":""},null,null,null,{"$f":"F35","v":"MPP APDE"},{"$f":"G35","v":""},"kg Milch","Milchproduktionspotenzial nach APDE pro kg TS (APDE/50)"]
[null,null,null,null,null,"MPP APDN",{"$f":"IF(G2=\"\",\"\",IF(G23=\"\",\"\",G23/50))","v":""},"kg Milch",{"$f":"IF($B$88=TRUE,A118,\"\")","v":"Milchproduktionspotenzial nach APDN pro kg TS (APDN/50)"},null,null,null,null,null,null,null,null,null,null,null,null,null,{"$f":"IF(W2=\"\",\"\",IF(W23=\"\",\"\",W23/50))","v":""},null,null,null,{"$f":"F36","v":"MPP APDN"},{"$f":"G36","v":""},"kg Milch","Milchproduktionspotenzial nach APDN pro kg TS (APDN/50)"]
[null,"yves.arrigo@agroscope.admin.ch",null,null,null,"RP/NEL ",{"$f":"IF(G2=\"\",\"\",IF(G3=\"\",\"\",IF(G20=\"\",\"\",G3/G20)))","v":""},"g/MJ",{"$f":"IF($B$88=TRUE,A119,\"\")","v":"Protein/Energie-Verhältnis (20g Laktation, 18g Galt & Ruhezeit, 19g Mast)"},null,null,null,null,null,null,null,null,null,null,null,null,null,{"$f":"IF(W2=\"\",\"\",IF(W3=\"\",\"\",IF(W20=\"\",\"\",W3/W20)))","v":""},null,null,null,{"$f":"F37","v":"RP/NEL "},{"$f":"G37","v":""},"g/MJ","Protein/Energie-Verhältnis (20g Laktation, 18g Galt & Ruhezeit, 19g Mast)"]
[]
[null,null,null,null,null,null,null,null,null,null,null,null,null,null,null,null,null,null,null,null,null,null,null,null,null,null,null,null,null,{"$f":"I39","v":0}]
[]
[null,null,null,null,"KORREKTUREN"]
[null,null,null,null,null,"Korrekturen der vOS nach Aufwuchs UND Entwicklungsstadium",null,null,null,null,null,{"$f":"IF(B66=16,\"keine Korrekture vOS\",INDEX(A67:A82,B66))","v":"Gräser"},null,{"$f":"IF(OR(G3=\"\",G5=\"\"),\"\",CONCATENATE(\"Korrekture vOS :  \",IF(Y120=0,0,ROUND(Y120-AC145,1))))","v":""}]
[null,null,null,null,null,null,null,null,null,null,null,null,null,null,null,{"$f":"IF($P$121=1,\"\",IF($P$122<>1,\"\",\"Wenn das Stadium fehlt, wird die vOS mit dem Aufwuchs und der Art des Futters korrigiert\"))","v":""}]
[null,null,null,null,null,{"$f":"IF(P122>1,IF(P121=1,\"Aufwuchs wählen\",\"\"),\"\")","v":""},"Aufwuchs",null,null,null,null,null,null,null,null,{"$f":"IF($P$121=1,\"\",IF($P$122<>1,\"\",\"Gras = Durchschnitt der Korrekturen für Stadium 2 und 3\"))","v":""},null,null,null,null,null,null,null,null,null,null,null,null,null,"Version 2017.06.06 mit neuen Korrekturen der vOS nach Aufwuchs und Entwicklungsstadium, Autor aryv"]
[null,null,null,null,null,null,null,null,null,null,null,null,null,null,null,{"$f":"IF($P$121=1,\"\",IF($P$122<>1,\"\",\"Silage = Durchschnitt der Korrekturen für Stadium 2 und 3\"))","v":""}]
[null,null,null,null,null,{"$f":"IF(P121>1,IF(P122=1,\"Stadium wählen\",\"\"),\"\")","v":""},"Stadium",null,null,null,null,null,null,null,null,{"$f":"IF($P$121=1,\"\",IF($P$122<>1,\"\",\"Dürrfutter = Durchschnitt der Korrekturen für Stadium 3 und 4\"))","v":""}]
[null,null,null,null,null,{"$f":"IF(P121=1,\"\",IF(P122<>1,\"\",\"sonst nach Aufwuchs+Art des Futters\"))","v":""},null,null,null,null,null,null,null,null,null,{"$f":"IF($P$121=1,\"\",IF($P$122<>1,\"\",\"Künstl. getrocknet = Durchschnitt der Korrekturen für Stadium 2 und 3\"))","v":""}]
[]
[]
[null,null,null,null,null,null,null,"Korrekturen für Silagen",null,null,null,"Korrekturen für Dürrfutter (Heu/Emd)"]
[null,null,null,null,null,null,null,null,null,null,null,null,null,null,null,"Korrekturen bei konserviertem Futter nur für"]
[null,null,null,null,null,null,"Gärqualität ",null,null,null,"Trocknungsart",null,null,null,null,"Tabellenwerte verwenden."]
[null,null,null,null,null,null,null,null,null,null,null,null,null,null,null,"Diese Abzüge sind bei den analysierten Werten inbegriffen !"]
[null,null,null,null,null,null,"Nachgärungen",null,null,null,"Witterung"]
[]
[null,null,null,null,null,null,"Korr. autom. TS 20-50",null,null,null,"Gärung"]
[]
[]
[null,null,null,null,null,"  "]
["TYPE",1,{"$f":"INDEX(B61:B64,B60)","v":"VER"},{"$f":"INDEX(C61:C64,B60)","v":"en vert"},"EDITION",1,null,"CHOIX DMO","Schätzung vOS mit RF GB06",1,{"$f":"INDEX(I60:I62,J60)","v":"Schätzung vOS mit RF GB06"},null,"maturité Maïs v.",null,null,"corrections ens.",null,{"$f":"SUM(G124,G127,G130)","v":3},{"$f":"IF(R60>3,\"Korrekturen Silagen eingeschaltet\",\"\")","v":""}]
["Grünfutter","VER","en vert",null,"aRP/vASF  GB06",null,null,null,"Schätzung vOS mit ADF GB06",null,null,null,null,null,null,"corrections sec",null,{"$f":"SUM(G134,G135,G137)","v":3},{"$f":"IF(R61>3,\"Korrekturen Dürrfutter eingeschaltet\",\"\")","v":""}]
["Silagen","ENS","ensilé",null,null,null,null,null,null,null,null,null,null,null,null,"corrections cycle-stade",null,{"$f":"SUM(P121:P122)","v":2},{"$f":"IF(R62>3,\"vOS korrigiert nach Aufw.+Stadium\",\"\")","v":""}]
["Dürrfutter","SEC","séché",null,"différencie calcul deMA, dAAA, PF",null,null,null,null,null,null,null,null,null,null,"pour remarques",null,null,{"$f":"IF(B60=2,S60,IF(B60=3,S61,\"\"))","v":""}]
["künstl. getrocknet","DZU","déshydraté",null,null,null,null,"formule choix de l'option si dMO 06….. Prendre deMA/dAAA LV06"]
[null,null,null,null,null,null,null,{"$f":"IF(J60<>3,IF(F60=1,\"\",\"PRENEZ OPTION deMA/dAAA LV06\"),IF(F60=1,\"PRENEZ OPTION deMA/dAAA LV99\",\"\"))","v":""}]
["BOTA",1,{"$f":"INDEX(B67:B82,B66)","v":"G"},null,null,null,"Typolgie"]
["Gräser","G",">70% Gräser",null,null,null,"10% englisches Raigras/ 50% Knaulgras/ 20% Wiesenfuchsschwanz/10% Weissklee/10% Löwenzahn",null,null,null,null,null,null,null,"G",{"$f":"INDEX(O67:O82,B66)","v":"G"},"Grünfutter",{"$f":"INDEX(Q67:Q70,B60)","v":"Grünfutter"}]
["Gräser (Raigras)","GR",">70% Gräser mit >50% Raigras",null,null,null,"50% englisches Raigras/ 10% italienisches Raigras/ 20% Knaulgrass/ 10% Weissklee/10% Löwenzahn",null,null,null,null,null,null,null,"GR",null,"Silagen"]
["Ausgewogen","E","50-70% Gräser",null,null,null,"10% englisches Raigras/ 35% Knaulgras/ 15% Wiesenfuchsschwanz/ 15% Weissklee/ 5% Rotklee/ 20% Löwenzahn",null,null,null,null,null,null,null,"A",null,"Dürrfutter"]
["Ausgewogen (Raigras)","ER","50-70% Gräser mit >50% Raigras",null,null,null,"35% englisches Raigras/ 10% italienisches Raigras/ 15% Knaulgras/ 15% Weissklee/ 5%Rotklee/ 20% Löwenzahn",null,null,null,null,null,null,null,"AR",null,"künstl. getrock."]
["Leguminosen","L",">50% Leguminosen",null,null,null,"15% englisches Raigras/ 10% Knaulgras/ 50% Weissklee/ 15% Rotklee/ 10% Löwenzahn",null,null,null,null,null,null,null,"L"]
["Kräuter feinblättrige","DF",">50% feinblättrige Kräuter",null,null,null,"15% englisches Raigras/ 10% Knaulgras/ 10% Weissklee/ 65% Löwenzahn",null,null,null,null,null,null,null,"KF"]
["Kräuter grobstängelige","DT",">50% grobstängelige Kräuter",null,null,null,"15% Knaulgras/ 10% Wiesenfuchsschwanz/ 10% Weissklee/ 5% Löwenzahn/ 30% Wiesenkerbel/ 30% Bärenklau",null,null,null,null,null,null,null,"KG"]
["Unbekannter Bestand","INC","nicht bestimmt",null,null,null,"Unbejkannter Best.",null,null,null,null,null,null,null,"unbekannt"]
["Knaulgras","dg","Reinbestande",null,null,null,"100% Knaulgras",null,null,null,null,null,null,null,"Knaulgrass"]
["Englisches Raigras","lp","Reinbestande",null,null,null,"100% Englisches Raigras",null,null,null,null,null,null,null,"engl. Raigras"]
["Italienisches Raigras","li","Reinbestande",null,null,null,"100% Italienisches Raigras",null,null,null,null,null,null,null,"ital. Raigras"]
["Wiesenfuchsschwanz","ap","Reinbestande",null,null,null,"100% Wiesenfuchsschwanz",null,null,null,null,null,null,null,"Wiesenfuchsschw."]
["Weissklee","tr","Reinbestande",null,null,null,"100% Weissklee",null,null,null,null,null,null,null,"Weissklee"]
["Rotklee","tp","Reinbestande",null,null,null,"100% Rotklee",null,null,null,null,null,null,null,"Rotklee"]
["Luzern","LUZ","Reinbestande",null,null,null,"100% Luzern",null,null,null,null,null,null,null,"Luzerne"]
["Mais","MAIS","Reinbestande",null,null,null,"100% Maïs",null,null,null,null,null,null,null,"MAÏS"]
["MAÏS option équations",null,"Mais GB06 korrigiert",null,"dMO retenue",{"$f":"AA145","v":0},"validation maïs ALP12 besoin CB, ADF, NDF"]
[1,null,"Mais ALP12 für GP",null,null,null,{"$f":"IF(A84>1,IF(OR(G6=\"\",G7=\"\",G4=\"\"),1,2),\"\")","v":""},"2,3 ALP12"]
[{"$f":"IF(B66<>16,2,A84)","v":2},null,"Mais ALP12 nicht GP",null,null,null,{"$f":"IF(G84=1,IF(AND(A84>1),1,0))","v":false},"si 1 pas de résultats car manque ADF,NDF"]
[]
[]
["DEFINITONStion",true]
["Trockensubstanzgehalt, 100 wenn die Gehalte in der TS angegeben werden"]
["Rohprotein"]
["Rohfaser"]
["Rohasche"]
["Lignozellulose (ADF)"]
["Zellwände (NDF)"]
["Rohfett (Rohlipide)"]
["Fermentationsprodukte der Silagen % TS angeben >  >  >"]
["Abbaubarkeit des Rohproteins"]
["Verdaulichkeit der aus dem Futter stammenden Aminosäuren"]
["Verdaulichkeit der Organischen Substanz (Daten in vivo oder Tabelle GB06, Korrekturen Aufwuchs und Stadium ausschalten!)"]
["Verdaulichkeit des Rohprotein (Daten in vivo oder Tabelle GB06)"]
[{"$f":"CONCATENATE(\"Verdaulichkeit der OS (\",IF(AA145=AC145,K60,\" gegeben\"), \"), benutzt für die Berechnung\")","v":"Verdaulichkeit der OS ( gegeben), benutzt für die Berechnung"}]
[{"$f":"CONCATENATE(\"Verdaulichkeit des RP (\",IF(G14=\"\",\"aus Gleichung\",\"gegeben\"),\" ), benutzt für die Berechnung\")","v":"Verdaulichkeit des RP (aus Gleichung ), benutzt für die Berechnung"}]
["Nettoenergie Milch"]
["Nettoenergie Mast"]
[{"$f":"CONCATENATE(\"Absorbierbares Protein im Darm, das auf Grund der verfügbaren Energiemenge aufgebaut werden kann \",\"(\",INDEX(E61:E62,F60),\")\")","v":"Absorbierbares Protein im Darm, das auf Grund der verfügbaren Energiemenge aufgebaut werden kann (aRP/vASF  GB06)"}]
[{"$f":"CONCATENATE(\"Absorbierbares Protein im Darm, das auf Grund des abgebauten Rohproteins aufgebaut werden kann \",\"(\",INDEX(E61:E62,F60),\")\")","v":"Absorbierbares Protein im Darm, das auf Grund des abgebauten Rohproteins aufgebaut werden kann (aRP/vASF  GB06)"}]
["Absorbierbares Protein im Darm, das aus dem abbaubaren Rohprotein aufgebaut werden kann",null,null,null,null,null,null,null,"Données exprimée dans la MS",null,null,"Données exprimée dans la MO",null,null,"HORS CHAMP D'APPLICATION !",null,null,null,null,"champ mélange",null,"champ cult. pure"]
["Menge Mikroorganismen-Protein, das aus der fermentierbaren Energie aufgebaut werden kann",null,null,null,null,null,null,null,"MS",{"$f":"G2*10","v":1000},"g "]
["Menge Mikroorganismen-Protein, das aus dem abbaubaren Rohprotein aufgebaut werden kann",null,null,null,null,null,null,null,"MA",{"$f":"G3/$J$108*1000","v":0},"g/kg MS","MAmo",{"$f":"J109/J115*1000","v":0},{"$f":"IF(M109=0,0,1)","v":0},{"$f":"IF($B$66<9,IF(J109<50,Q109,IF(J109>280,Q109,\"\")),IF(J109<50,Q109,IF(J109>320,Q109,\"\")))","v":"RP aus dem Anwendungsbereich"},null,"RP aus dem Anwendungsbereich",null,null,"50 - 280","MA","50 - 320"]
["Absorbierbares Protein im Darm aus dem Futter",null,null,null,null,null,null,null,"CB",{"$f":"G4/$J$108*1000","v":0},"g/kg MS","CBmo",{"$f":"J110/J115*1000","v":0},{"$f":"IF(M110=0,0,1)","v":0},{"$f":"IF($B$66<9,IF(J110<130,Q110,IF(J110>400,Q110,\"\")),IF(J110<130,Q110,IF(J110>410,Q110,\"\")))","v":"RF aus dem Anwendungsbereich"},null,"RF aus dem Anwendungsbereich",null,null,"130 - 400","CB","130 - 410"]
["Mikrobielles absorbierbares Protein im Darm (FOS x 0.093)",null,null,null,null,null,null,null,"CE",{"$f":"G5/$J$108*1000","v":0},"g/kg MS","NDFmo",{"$f":"J113/J115*1000","v":0}]
["Umsetzbare Energie",null,null,null,null,null,null,null,"ADF",{"$f":"G6/$J$108*1000","v":0},"g/kg MS","ENAmo",{"$f":"J117/J115*1000","v":1000},null,{"$f":"IF($B$66<9,IF(J112<170,Q112,IF(J112>420,Q112,\"\")),IF(J112<150,Q112,IF(J112>450,Q112,\"\")))","v":"ADF aus dem Anwendungsbereich"},null,"ADF aus dem Anwendungsbereich",null,null,"170 - 420","ADF","150 - 450"]
[{"$f":"IF(G6=\"\",\"Orientierungswert für Lignozellulose (ADF) aus Gleichung Basis RF und botanische Zus.\",\"Lignozellulose (ADF) gegeben\")","v":"Orientierungswert für Lignozellulose (ADF) aus Gleichung Basis RF und botanische Zus."},null,null,null,null,null,null,null,"NDF",{"$f":"G7/$J$108*1000","v":0},"g/kg MS","MAmo2",{"$f":"M109^2","v":0}]
[{"$f":"IF(G7=\"\",\"Orientierungswert für Zellwände (NDF) aus Gleichung Basis RF und botanische Zus.\",\"Zellwände (NDF) gegeben\")","v":"Orientierungswert für Zellwände (NDF) aus Gleichung Basis RF und botanische Zus."},null,null,null,null,null,null,null,"MG",{"$f":"IF(G8=\"\",0,G8/$J$108*1000)","v":0},"g/kg MS","CBmo2",{"$f":"M110^2","v":0},null,{"$f":"IF($B$66<9,IF(AD145<55,Q114,IF(AD145>84,Q114,\"\")),IF(AD145<45,Q114,IF(AD145>87,Q114,\"\")))","v":{"$error":"#VALUE!"}},null,"vOS aus dem Anwendungsbereich",null,null,"55 - 84","dMO","45 - 87",null,null,null,null,null,null,null,null,null,null,null,null,null,null,null,null,null,null,null,null,null,null,null,"TYPE",{"$f":"INDEX(AU116:AU119,AU115)","v":"VER"},"botanique:",{"$f":"C66","v":"G"}]
["Orientierungswert für Zucker aus Gleichung Basis RF und botanische Zus.",null,null,null,null,null,null,null,"MO",{"$f":"1000-J111","v":1000},"g/kg MS","HEMmo",{"$f":"J116/J115*1000","v":0},null,null,null,null,null,null,null,null,null,null,null,null,null," ",null,null,null,null,null,null,null,null,null,null,null,null,null,null,null,null,null,null,null,{"$f":"B60","v":1},null,{"$f":"B66","v":1}]
["Milchproduktionspotenzial nach NEL pro kg TS (NEL/3.14)",null,null,null,null,null,null,null,"HEM",{"$f":"J113-J112","v":0},"g/kg MS",null,null,null,null,null,null,null,null,null,null,null,null,null,null,null,null,null,null,null,null,null,null,null,null,null,null,null,null,null,null,null,null,null,null,"en vert","VER"]
["Milchproduktionspotenzial nach APDE pro kg TS (APDE/50)",null,null,null,null,null,null,null,"ENA",{"$f":"J115-J109-J110-J114","v":1000},"g/kg MS",null,null,null,null,null,null,null,null,null,null,null,null,null,null,null,null,null,null,null,null,null,null,null,null,null,null,null,null,null,null,null,null,null,null,"ensilage","ENS"]
["Milchproduktionspotenzial nach APDN pro kg TS (APDN/50)",null,null,null,null,null,null,null,null,null,null,null,null,null,null,null,null,null,null,null,null,null,null,null,null,null,null,null,null,null,null,null,null,null,null,null,null,null,null,null,null,null,null,null,null,"sec","SEC"]
["Protein/Energie-Verhältnis (20g Laktation, 18g Galt & Ruhezeit, 19g Mast)",null,null,null,null,null,null,null,null,null,null,null,null,null,null,null,null,null,null,null,null,null,null,null,null,null,null,null,null,null,null,null,null,null,null,null,null,null,null,null,null,null,null,null,null,"déshydraté artificiellement","DZU"]
["* Standardeinstellung, andere Daten können engefügt werden, dann braucht es ein Zurücksetzen für weitere Berchnungen",null,null,null,null,null,null,null,null,null,null,null,null,null,"corrections 2017 dMo selon cycles et stades",null,null,null,null,null,null,null,null,"dMO corrigée",{"$f":"SUM(Z125:AI139)+BC122+AC145","v":{"$error":"#VALUE!"}},"correction dMo selon cycles et stades des espèces pures",{"$f":"P120","v":0},null,null,null,null,null,null,null,null,null,"correction cycle sans stade donné",null,null,null,null,null,null,"correction sans stades",null,null,null,"stade manque"]
[null,null,null,null,null,null,null,null,null,null,null,null,null,null,"cycle position",1," = cycle",{"$f":"P121-1","v":0},null,null,null,null,null,null,null,"cycle",{"$f":"P121","v":1},"1=sans correct; 2=cycle 1;3=cycle 2+",null,null,null,null,null,null,null,null,null,null,null,null,null,null,null,"1er cycle",null,null,null,"2em et suivants",null,null,null,"1er","2ème ss","pour cycle","correct selon conserve:"]
[null,null,null,null,null,null,null,null,null,null,null,null,null,null,"stade position",1," = stade",{"$f":"P122-1","v":0},null,null,null,null,null,null,null,"stade",{"$f":"P122","v":1},"1=sans correct; 2=std 2;3=std 3; 4=std 4",null,null,null,null,null,null,null,null,null,null,null,null,null,null,null,"herbe","ensilage","sec","déshydr.","herbe","ensilage","sec","déshydr.",null,null,{"$f":"AA121-1","v":0},{"$f":"IF(AND(AA121>1,AA122=1),SUM(BC125:BC139),0)","v":0},{"$f":"IF(BC122=0,0,BC122+AC145)","v":0},"dMO corrigée"]
["corrections pour ensilages",null,null,"NEL, NEV","PAIE","PAIN",{"$f":"IF(B60=2,M9,\"\")","v":""},"MS",null,"NEL","NEV","PAIE","PAIN",null,null,"1er cycle",null,null,null,null,"repousses",null,null,null,null,"1er cycle",null,null,null,null,"repousses",null,null,null,null,null,null,"1er cycle",null,null,"repousses",null,null,null,null,null,null,null,null,null,null,null,null,null,null,null,"selon cycle"]
["MS <20%",null,null,-1,-6,0,1,"sans corrections =1",null,{"$f":"IF(G124=1,0,IF(G123=0,0,IF(G123<20,D124,IF(G123>50,D125,0))))","v":0},{"$f":"IF(G124=1,0,IF(G123=0,0,IF(G123<20,D124,IF(G123>50,D125,0))))","v":0},{"$f":"IF(G124=1,0,IF(G123=0,0,IF(G123<20,E124,IF(G123>50,E125,0))))","v":0},{"$f":"IF(G124=1,0,IF(G123=0,0,IF(G123<20,F124,IF(G123>50,F125,0))))","v":0},null,null,"stade 1","stade 2","stade 3","stade 4","stade 5","stade 1","stade 2","stade 3","stade 4","stade 5","stade 1","stade 2","stade 3","stade 4","stade 5","stade 1","stade 2","stade 3","stade 4","stade 5",null,null,"stade 2","stade 3","stade 4","stade 2","stade 3","stade 4","moy st. 2-3","moy st. 2-3","moy st. 3-4","moy st. 2-3","moy st. 2-3","moy st. 2-3","moy st. 3-4","moy st. 2-3",null,null,null,null,null,"sans stade mais "]
["MS >50%",null,null,-1,6,0,null,null,null,null,null,null,null,null,"G",5,5,4,3,0,-2,-2,-2,-2,-3,{"$f":"IF($P$121=2,IF($P$122=2,IF($AC$145=0,\"\",IF($B$66=1,P125,\"\")),\"\"),\"\")","v":""},{"$f":"IF($P$121=2,IF($P$122=3,IF($AC$145=0,\"\",IF($B$66=1,Q125,\"\")),\"\"),\"\")","v":""},{"$f":"IF($P$121=2,IF($P$122=4,IF($AC$145=0,\"\",IF($B$66=1,R125,\"\")),\"\"),\"\")","v":""},{"$f":"IF($P$121=2,IF($P$122=5,IF($AC$145=0,\"\",IF($B$66=1,S125,\"\")),\"\"),\"\")","v":""},{"$f":"IF($P$121=2,IF($P$122=6,IF($AC$145=0,\"\",IF($B$66=1,T125,\"\")),\"\"),\"\")","v":""},{"$f":"IF($P$121=3,IF($P$122=2,IF($AC$145=0,\"\",IF($B$66=1,U125,\"\")),\"\"),\"\")","v":""},{"$f":"IF($P$121=3,IF($P$122=3,IF($AC$145=0,\"\",IF($B$66=1,V125,\"\")),\"\"),\"\")","v":""},{"$f":"IF($P$121=3,IF($P$122=4,IF($AC$145=0,\"\",IF($B$66=1,W125,\"\")),\"\"),\"\")","v":""},{"$f":"IF($P$121=3,IF($P$122=5,IF($AC$145=0,\"\",IF($B$66=1,X125,\"\")),\"\"),\"\")","v":""},{"$f":"IF($P$121=3,IF($P$122=6,IF($AC$145=0,\"\",IF($B$66=1,Y125,\"\")),\"\"),\"\")","v":""},null,"G",{"$f":"Q125","v":5},{"$f":"R125","v":4},3,{"$f":"V125","v":-2},{"$f":"W125","v":-2},-2,{"$f":"ROUND(AVERAGE(AL125:AM125),1)","v":4.5},{"$f":"ROUND(AVERAGE(AL125:AM125),1)","v":4.5},{"$f":"ROUND(AVERAGE(AM125:AN125),1)","v":3.5},{"$f":"ROUND(AVERAGE(AL125:AM125),1)","v":4.5},{"$f":"ROUND(AVERAGE(AO125:AP125),1)","v":-2},{"$f":"ROUND(AVERAGE(AO125:AP125),1)","v":-2},{"$f":"ROUND(AVERAGE(AP125:AQ125),1)","v":-2},{"$f":"ROUND(AVERAGE(AO125:AP125),1)","v":-2},{"$f":"IF($AV$115=1,AR125,IF($AV$115=2,AS125,IF($AV$115=3,AT125,AU125)))","v":4.5},{"$f":"IF($AV$115=1,AV125,IF($AV$115=2,AW125,IF($AV$115=3,AX125,AY125)))","v":-2},{"$f":"IF($BB$122+1=2,AZ125,BA125)","v":-2},{"$f":"IF($AW$115=1,BB125,\"\")","v":-2},null,"conserve"]
["normal",null,null,null,null,null,null,null,null,null,null,null,null,null,"GR",6,6,5,5,3,-1,-1,-2,-4,-4,{"$f":"IF($P$121=2,IF($P$122=2,IF($AC$145=0,\"\",IF($B$66=2,P126,\"\")),\"\"),\"\")","v":""},{"$f":"IF($P$121=2,IF($P$122=3,IF($AC$145=0,\"\",IF($B$66=2,Q126,\"\")),\"\"),\"\")","v":""},{"$f":"IF($P$121=2,IF($P$122=4,IF($AC$145=0,\"\",IF($B$66=2,R126,\"\")),\"\"),\"\")","v":""},{"$f":"IF($P$121=2,IF($P$122=5,IF($AC$145=0,\"\",IF($B$66=2,S126,\"\")),\"\"),\"\")","v":""},{"$f":"IF($P$121=2,IF($P$122=6,IF($AC$145=0,\"\",IF($B$66=2,T126,\"\")),\"\"),\"\")","v":""},{"$f":"IF($P$121=3,IF($P$122=2,IF($AC$145=0,\"\",IF($B$66=2,U126,\"\")),\"\"),\"\")","v":""},{"$f":"IF($P$121=3,IF($P$122=3,IF($AC$145=0,\"\",IF($B$66=2,V126,\"\")),\"\"),\"\")","v":""},{"$f":"IF($P$121=3,IF($P$122=4,IF($AC$145=0,\"\",IF($B$66=2,W126,\"\")),\"\"),\"\")","v":""},{"$f":"IF($P$121=3,IF($P$122=5,IF($AC$145=0,\"\",IF($B$66=2,X126,\"\")),\"\"),\"\")","v":""},{"$f":"IF($P$121=3,IF($P$122=6,IF($AC$145=0,\"\",IF($B$66=2,Y126,\"\")),\"\"),\"\")","v":""},null,"GR",{"$f":"Q126","v":6},5,5,{"$f":"V126","v":-1},-2,-4,{"$f":"ROUND(AVERAGE(AL126:AM126),1)","v":5.5},{"$f":"ROUND(AVERAGE(AL126:AM126),1)","v":5.5},5,{"$f":"ROUND(AVERAGE(AL126:AM126),1)","v":5.5},{"$f":"ROUND(AVERAGE(AO126:AP126),1)","v":-1.5},{"$f":"ROUND(AVERAGE(AO126:AP126),1)","v":-1.5},-3,{"$f":"ROUND(AVERAGE(AO126:AP126),1)","v":-1.5},5.5,-1.5,-1.5,{"$f":"IF($AW$115=2,BB126,\"\")","v":""}]
["qualité fermentaire défectueuse",null,null,-2,-6,0,1,{"$f":"INDEX(A126:A128,G127)","v":"normal"},null,{"$f":"IF(G127=2,D127,IF(G127=3,D128,0))","v":0},{"$f":"IF(G127=2,D127,IF(G127=3,D128,0))","v":0},{"$f":"IF(G127=2,E127,IF(G127=3,E128,0))","v":0},{"$f":"IF(G127=2,F127,IF(G127=3,F1192,0))","v":0},null,"E",4,4,4,3,0,-2,-2,-3,-3,-3,{"$f":"IF($P$121=2,IF($P$122=2,IF($AC$145=0,\"\",IF($B$66=3,P127,\"\")),\"\"),\"\")","v":""},{"$f":"IF($P$121=2,IF($P$122=3,IF($AC$145=0,\"\",IF($B$66=3,Q127,\"\")),\"\"),\"\")","v":""},{"$f":"IF($P$121=2,IF($P$122=4,IF($AC$145=0,\"\",IF($B$66=3,R127,\"\")),\"\"),\"\")","v":""},{"$f":"IF($P$121=2,IF($P$122=5,IF($AC$145=0,\"\",IF($B$66=3,S127,\"\")),\"\"),\"\")","v":""},{"$f":"IF($P$121=2,IF($P$122=6,IF($AC$145=0,\"\",IF($B$66=3,T127,\"\")),\"\"),\"\")","v":""},{"$f":"IF($P$121=3,IF($P$122=2,IF($AC$145=0,\"\",IF($B$66=3,U127,\"\")),\"\"),\"\")","v":""},{"$f":"IF($P$121=3,IF($P$122=3,IF($AC$145=0,\"\",IF($B$66=3,V127,\"\")),\"\"),\"\")","v":""},{"$f":"IF($P$121=3,IF($P$122=4,IF($AC$145=0,\"\",IF($B$66=3,W127,\"\")),\"\"),\"\")","v":""},{"$f":"IF($P$121=3,IF($P$122=5,IF($AC$145=0,\"\",IF($B$66=3,X127,\"\")),\"\"),\"\")","v":""},{"$f":"IF($P$121=3,IF($P$122=6,IF($AC$145=0,\"\",IF($B$66=3,Y127,\"\")),\"\"),\"\")","v":""},null,"E",4,4,3,-2,-3,-3,4,4,3.5,4,-2.5,-2.5,-3,-2.5,4,-2.5,-2.5,{"$f":"IF($AW$115=3,BB127,\"\")","v":""}]
["qualité fermentaire mauvaise",null,null,-5,-15,-3,null,null,null,null,null,null,null,null,"ER",5,5,5,5,2,-1,-1,-2,-3,-3,{"$f":"IF($P$121=2,IF($P$122=2,IF($AC$145=0,\"\",IF($B$66=4,P128,\"\")),\"\"),\"\")","v":""},{"$f":"IF($P$121=2,IF($P$122=3,IF($AC$145=0,\"\",IF($B$66=4,Q128,\"\")),\"\"),\"\")","v":""},{"$f":"IF($P$121=2,IF($P$122=4,IF($AC$145=0,\"\",IF($B$66=4,R128,\"\")),\"\"),\"\")","v":""},{"$f":"IF($P$121=2,IF($P$122=5,IF($AC$145=0,\"\",IF($B$66=4,S128,\"\")),\"\"),\"\")","v":""},{"$f":"IF($P$121=2,IF($P$122=6,IF($AC$145=0,\"\",IF($B$66=4,T128,\"\")),\"\"),\"\")","v":""},{"$f":"IF($P$121=3,IF($P$122=2,IF($AC$145=0,\"\",IF($B$66=4,U128,\"\")),\"\"),\"\")","v":""},{"$f":"IF($P$121=3,IF($P$122=3,IF($AC$145=0,\"\",IF($B$66=4,V128,\"\")),\"\"),\"\")","v":""},{"$f":"IF($P$121=3,IF($P$122=4,IF($AC$145=0,\"\",IF($B$66=4,W128,\"\")),\"\"),\"\")","v":""},{"$f":"IF($P$121=3,IF($P$122=5,IF($AC$145=0,\"\",IF($B$66=4,X128,\"\")),\"\"),\"\")","v":""},{"$f":"IF($P$121=3,IF($P$122=6,IF($AC$145=0,\"\",IF($B$66=4,Y128,\"\")),\"\"),\"\")","v":""},null,"ER",5,5,5,-1,-2,-3,5,5,5,5,-1.5,-1.5,-2.5,-1.5,5,-1.5,-1.5,{"$f":"IF($AW$115=4,BB128,\"\")","v":""}]
["normal",null,null,null,null,null,null,null,null,null,null,null,null,null,"L",3,4,5,5,3,2,1,0,0,-1,{"$f":"IF($P$121=2,IF($P$122=2,IF($AC$145=0,\"\",IF($B$66=5,P129,\"\")),\"\"),\"\")","v":""},{"$f":"IF($P$121=2,IF($P$122=3,IF($AC$145=0,\"\",IF($B$66=5,Q129,\"\")),\"\"),\"\")","v":""},{"$f":"IF($P$121=2,IF($P$122=4,IF($AC$145=0,\"\",IF($B$66=5,R129,\"\")),\"\"),\"\")","v":""},{"$f":"IF($P$121=2,IF($P$122=5,IF($AC$145=0,\"\",IF($B$66=5,S129,\"\")),\"\"),\"\")","v":""},{"$f":"IF($P$121=2,IF($P$122=6,IF($AC$145=0,\"\",IF($B$66=5,T129,\"\")),\"\"),\"\")","v":""},{"$f":"IF($P$121=3,IF($P$122=2,IF($AC$145=0,\"\",IF($B$66=5,U129,\"\")),\"\"),\"\")","v":""},{"$f":"IF($P$121=3,IF($P$122=3,IF($AC$145=0,\"\",IF($B$66=5,V129,\"\")),\"\"),\"\")","v":""},{"$f":"IF($P$121=3,IF($P$122=4,IF($AC$145=0,\"\",IF($B$66=5,W129,\"\")),\"\"),\"\")","v":""},{"$f":"IF($P$121=3,IF($P$122=5,IF($AC$145=0,\"\",IF($B$66=5,X129,\"\")),\"\"),\"\")","v":""},{"$f":"IF($P$121=3,IF($P$122=6,IF($AC$145=0,\"\",IF($B$66=5,Y129,\"\")),\"\"),\"\")","v":""},null,"L",4,5,5,1,0,0,4.5,4.5,5,4.5,0.5,0.5,0,0.5,4.5,0.5,0.5,{"$f":"IF($AW$115=5,BB129,\"\")","v":""}]
["postfermentations légèrement échauffé",null,null,-4,-15,-3,1,{"$f":"INDEX(A129:A130,G130)","v":"normal"},null,{"$f":"IF(G130=2,D130,0)","v":0},{"$f":"IF(G130=2,D130,0)","v":0},{"$f":"IF(G130=2,E130,0)","v":0},{"$f":"IF(G130=2,F130,0)","v":0},null,"DF",3,3,3,3,2,-2,-2,-2,-2,-4,{"$f":"IF($P$121=2,IF($P$122=2,IF($AC$145=0,\"\",IF($B$66=6,P130,\"\")),\"\"),\"\")","v":""},{"$f":"IF($P$121=2,IF($P$122=3,IF($AC$145=0,\"\",IF($B$66=6,Q130,\"\")),\"\"),\"\")","v":""},{"$f":"IF($P$121=2,IF($P$122=4,IF($AC$145=0,\"\",IF($B$66=6,R130,\"\")),\"\"),\"\")","v":""},{"$f":"IF($P$121=2,IF($P$122=5,IF($AC$145=0,\"\",IF($B$66=6,S130,\"\")),\"\"),\"\")","v":""},{"$f":"IF($P$121=2,IF($P$122=6,IF($AC$145=0,\"\",IF($B$66=6,T130,\"\")),\"\"),\"\")","v":""},{"$f":"IF($P$121=3,IF($P$122=2,IF($AC$145=0,\"\",IF($B$66=6,U130,\"\")),\"\"),\"\")","v":""},{"$f":"IF($P$121=3,IF($P$122=3,IF($AC$145=0,\"\",IF($B$66=6,V130,\"\")),\"\"),\"\")","v":""},{"$f":"IF($P$121=3,IF($P$122=4,IF($AC$145=0,\"\",IF($B$66=6,W130,\"\")),\"\"),\"\")","v":""},{"$f":"IF($P$121=3,IF($P$122=5,IF($AC$145=0,\"\",IF($B$66=6,X130,\"\")),\"\"),\"\")","v":""},{"$f":"IF($P$121=3,IF($P$122=6,IF($AC$145=0,\"\",IF($B$66=6,Y130,\"\")),\"\"),\"\")","v":""},null,"DF",3,3,3,-2,-2,-2,3,3,3,3,-2,-2,-2,-2,3,-2,-2,{"$f":"IF($AW$115=6,BB130,\"\")","v":""}]
[null,null,null,null,null,null,null,null,"% corrections",{"$f":"SUM(J124,J127,J130)/100","v":0},{"$f":"SUM(K124,K127,K130)/100","v":0},{"$f":"SUM(L124,L127,L130)/100","v":0},{"$f":"SUM(M124,M127,M130)/100","v":0},null,"DT",2,2,2,-1,-5,1,-1,-4,-6,-11,{"$f":"IF($P$121=2,IF($P$122=2,IF($AC$145=0,\"\",IF($B$66=7,P131,\"\")),\"\"),\"\")","v":""},{"$f":"IF($P$121=2,IF($P$122=3,IF($AC$145=0,\"\",IF($B$66=7,Q131,\"\")),\"\"),\"\")","v":""},{"$f":"IF($P$121=2,IF($P$122=4,IF($AC$145=0,\"\",IF($B$66=7,R131,\"\")),\"\"),\"\")","v":""},{"$f":"IF($P$121=2,IF($P$122=5,IF($AC$145=0,\"\",IF($B$66=7,S131,\"\")),\"\"),\"\")","v":""},{"$f":"IF($P$121=2,IF($P$122=6,IF($AC$145=0,\"\",IF($B$66=7,T131,\"\")),\"\"),\"\")","v":""},{"$f":"IF($P$121=3,IF($P$122=2,IF($AC$145=0,\"\",IF($B$66=7,U131,\"\")),\"\"),\"\")","v":""},{"$f":"IF($P$121=3,IF($P$122=3,IF($AC$145=0,\"\",IF($B$66=7,V131,\"\")),\"\"),\"\")","v":""},{"$f":"IF($P$121=3,IF($P$122=4,IF($AC$145=0,\"\",IF($B$66=7,W131,\"\")),\"\"),\"\")","v":""},{"$f":"IF($P$121=3,IF($P$122=5,IF($AC$145=0,\"\",IF($B$66=7,X131,\"\")),\"\"),\"\")","v":""},{"$f":"IF($P$121=3,IF($P$122=6,IF($AC$145=0,\"\",IF($B$66=7,Y131,\"\")),\"\"),\"\")","v":""},null,"DT",2,2,-1,-1,-4,-6,2,2,0.5,2,-2.5,-2.5,-5,-2.5,2,-2.5,-2.5,{"$f":"IF($AW$115=7,BB131,\"\")","v":""}]
[null,null,null,null,null,null,null,null,null,null,null,null,null,null,"Dactyle",-2,0,3,5,4,1,0,0,-3,-2,{"$f":"IF($P$121=2,IF($P$122=2,IF($AC$145=0,\"\",IF($B$66=9,P132,\"\")),\"\"),\"\")","v":""},{"$f":"IF($P$121=2,IF($P$122=3,IF($AC$145=0,\"\",IF($B$66=9,Q132,\"\")),\"\"),\"\")","v":""},{"$f":"IF($P$121=2,IF($P$122=4,IF($AC$145=0,\"\",IF($B$66=9,R132,\"\")),\"\"),\"\")","v":""},{"$f":"IF($P$121=2,IF($P$122=5,IF($AC$145=0,\"\",IF($B$66=9,S132,\"\")),\"\"),\"\")","v":""},{"$f":"IF($P$121=2,IF($P$122=6,IF($AC$145=0,\"\",IF($B$66=9,T132,\"\")),\"\"),\"\")","v":""},{"$f":"IF($P$121=3,IF($P$122=2,IF($AC$145=0,\"\",IF($B$66=9,U132,\"\")),\"\"),\"\")","v":""},{"$f":"IF($P$121=3,IF($P$122=3,IF($AC$145=0,\"\",IF($B$66=9,V132,\"\")),\"\"),\"\")","v":""},{"$f":"IF($P$121=3,IF($P$122=4,IF($AC$145=0,\"\",IF($B$66=9,W132,\"\")),\"\"),\"\")","v":""},{"$f":"IF($P$121=3,IF($P$122=5,IF($AC$145=0,\"\",IF($B$66=9,X132,\"\")),\"\"),\"\")","v":""},{"$f":"IF($P$121=3,IF($P$122=6,IF($AC$145=0,\"\",IF($B$66=9,Y132,\"\")),\"\"),\"\")","v":""},null,"Dactyle",0,3,5,0,0,-3,1.5,1.5,4,1.5,0,0,-1.5,0,1.5,0,0,{"$f":"IF($AW$115=9,BB132,\"\")","v":""}]
["corrections pour fourrages secs",null,null,"NEL, NEV","PAIE","PAIN",null,null,null,"NEL","NEV","PAIE","PAIN",null,"RG anglais",-2,0,3,5,5,-1,-2,-4,-4,-4,{"$f":"IF($P$121=2,IF($P$122=2,IF($AC$145=0,\"\",IF($B$66=10,P133,\"\")),\"\"),\"\")","v":""},{"$f":"IF($P$121=2,IF($P$122=3,IF($AC$145=0,\"\",IF($B$66=10,Q133,\"\")),\"\"),\"\")","v":""},{"$f":"IF($P$121=2,IF($P$122=4,IF($AC$145=0,\"\",IF($B$66=10,R133,\"\")),\"\"),\"\")","v":""},{"$f":"IF($P$121=2,IF($P$122=5,IF($AC$145=0,\"\",IF($B$66=10,S133,\"\")),\"\"),\"\")","v":""},{"$f":"IF($P$121=2,IF($P$122=6,IF($AC$145=0,\"\",IF($B$66=10,T133,\"\")),\"\"),\"\")","v":""},{"$f":"IF($P$121=3,IF($P$122=2,IF($AC$145=0,\"\",IF($B$66=10,U133,\"\")),\"\"),\"\")","v":""},{"$f":"IF($P$121=3,IF($P$122=3,IF($AC$145=0,\"\",IF($B$66=10,V133,\"\")),\"\"),\"\")","v":""},{"$f":"IF($P$121=3,IF($P$122=4,IF($AC$145=0,\"\",IF($B$66=10,W133,\"\")),\"\"),\"\")","v":""},{"$f":"IF($P$121=3,IF($P$122=5,IF($AC$145=0,\"\",IF($B$66=10,X133,\"\")),\"\"),\"\")","v":""},{"$f":"IF($P$121=3,IF($P$122=6,IF($AC$145=0,\"\",IF($B$66=10,Y133,\"\")),\"\"),\"\")","v":""},null,"RG anglais",0,3,5,-2,-4,-4,1.5,1.5,4,1.5,-3,-3,-4,-3,1.5,-3,-3,{"$f":"IF($AW$115=10,BB133,\"\")","v":""}]
["séchage au sol",null,null,-4,-3,0,1,null,null,{"$f":"IF(G134=2,D134,0)","v":0},{"$f":"IF(G134=2,D134,0)","v":0},{"$f":"IF(G134=2,E134,0)","v":0},{"$f":"IF(G134=2,F134,0)","v":0},null,"RG itallien",-3,-1,3,4,-2,0,3,4,2,-3,{"$f":"IF($P$121=2,IF($P$122=2,IF($AC$145=0,\"\",IF($B$66=11,P134,\"\")),\"\"),\"\")","v":""},{"$f":"IF($P$121=2,IF($P$122=3,IF($AC$145=0,\"\",IF($B$66=11,Q134,\"\")),\"\"),\"\")","v":""},{"$f":"IF($P$121=2,IF($P$122=4,IF($AC$145=0,\"\",IF($B$66=11,R134,\"\")),\"\"),\"\")","v":""},{"$f":"IF($P$121=2,IF($P$122=5,IF($AC$145=0,\"\",IF($B$66=11,S134,\"\")),\"\"),\"\")","v":""},{"$f":"IF($P$121=2,IF($P$122=6,IF($AC$145=0,\"\",IF($B$66=11,T134,\"\")),\"\"),\"\")","v":""},{"$f":"IF($P$121=3,IF($P$122=2,IF($AC$145=0,\"\",IF($B$66=11,U134,\"\")),\"\"),\"\")","v":""},{"$f":"IF($P$121=3,IF($P$122=3,IF($AC$145=0,\"\",IF($B$66=11,V134,\"\")),\"\"),\"\")","v":""},{"$f":"IF($P$121=3,IF($P$122=4,IF($AC$145=0,\"\",IF($B$66=11,W134,\"\")),\"\"),\"\")","v":""},{"$f":"IF($P$121=3,IF($P$122=5,IF($AC$145=0,\"\",IF($B$66=11,X134,\"\")),\"\"),\"\")","v":""},{"$f":"IF($P$121=3,IF($P$122=6,IF($AC$145=0,\"\",IF($B$66=11,Y134,\"\")),\"\"),\"\")","v":""},null,"RG itallien",-1,3,4,3,4,2,1,1,3.5,1,3.5,3.5,3,3.5,1,3.5,3.5,{"$f":"IF($AW$115=11,BB134,\"\")","v":""}]
["1 jour de pluie",null,null,-5,-8,-2,1,null,null,{"$f":"IF(G135=2,D135,IF(G135=3,D136,0))","v":0},{"$f":"IF(G135=2,D135,IF(G135=3,D136,0))","v":0},{"$f":"IF(G135=2,E135,IF(G135=3,E136,0))","v":0},{"$f":"IF(G135=2,F135,IF(H135=3,F136,0))","v":0},null,"Vulpin",0,5,3,2,0,-2,-3,-3,-3,-3,{"$f":"IF($P$121=2,IF($P$122=2,IF($AC$145=0,\"\",IF($B$66=12,P135,\"\")),\"\"),\"\")","v":""},{"$f":"IF($P$121=2,IF($P$122=3,IF($AC$145=0,\"\",IF($B$66=12,Q135,\"\")),\"\"),\"\")","v":""},{"$f":"IF($P$121=2,IF($P$122=4,IF($AC$145=0,\"\",IF($B$66=12,R135,\"\")),\"\"),\"\")","v":""},{"$f":"IF($P$121=2,IF($P$122=5,IF($AC$145=0,\"\",IF($B$66=12,S135,\"\")),\"\"),\"\")","v":""},{"$f":"IF($P$121=2,IF($P$122=6,IF($AC$145=0,\"\",IF($B$66=12,T135,\"\")),\"\"),\"\")","v":""},{"$f":"IF($P$121=3,IF($P$122=2,IF($AC$145=0,\"\",IF($B$66=12,U135,\"\")),\"\"),\"\")","v":""},{"$f":"IF($P$121=3,IF($P$122=3,IF($AC$145=0,\"\",IF($B$66=12,V135,\"\")),\"\"),\"\")","v":""},{"$f":"IF($P$121=3,IF($P$122=4,IF($AC$145=0,\"\",IF($B$66=12,W135,\"\")),\"\"),\"\")","v":""},{"$f":"IF($P$121=3,IF($P$122=5,IF($AC$145=0,\"\",IF($B$66=12,X135,\"\")),\"\"),\"\")","v":""},{"$f":"IF($P$121=3,IF($P$122=6,IF($AC$145=0,\"\",IF($B$66=12,Y135,\"\")),\"\"),\"\")","v":""},null,"Vulpin",5,3,2,-3,-3,-3,4,4,2.5,4,-3,-3,-3,-3,4,-3,-3,{"$f":"IF($AW$115=12,BB135,\"\")","v":""}]
["2 jours et plus de pluie",null,null,-8,-15,-3,null,null,null,null,null,null,null,null,"Trèfle blanc",2,3,3,2,1,1,1,1,0,-3,{"$f":"IF($P$121=2,IF($P$122=2,IF($AC$145=0,\"\",IF($B$66=13,P136,\"\")),\"\"),\"\")","v":""},{"$f":"IF($P$121=2,IF($P$122=3,IF($AC$145=0,\"\",IF($B$66=13,Q136,\"\")),\"\"),\"\")","v":""},{"$f":"IF($P$121=2,IF($P$122=4,IF($AC$145=0,\"\",IF($B$66=13,R136,\"\")),\"\"),\"\")","v":""},{"$f":"IF($P$121=2,IF($P$122=5,IF($AC$145=0,\"\",IF($B$66=13,S136,\"\")),\"\"),\"\")","v":""},{"$f":"IF($P$121=2,IF($P$122=6,IF($AC$145=0,\"\",IF($B$66=13,T136,\"\")),\"\"),\"\")","v":""},{"$f":"IF($P$121=3,IF($P$122=2,IF($AC$145=0,\"\",IF($B$66=13,U136,\"\")),\"\"),\"\")","v":""},{"$f":"IF($P$121=3,IF($P$122=3,IF($AC$145=0,\"\",IF($B$66=13,V136,\"\")),\"\"),\"\")","v":""},{"$f":"IF($P$121=3,IF($P$122=4,IF($AC$145=0,\"\",IF($B$66=13,W136,\"\")),\"\"),\"\")","v":""},{"$f":"IF($P$121=3,IF($P$122=5,IF($AC$145=0,\"\",IF($B$66=13,X136,\"\")),\"\"),\"\")","v":""},{"$f":"IF($P$121=3,IF($P$122=6,IF($AC$145=0,\"\",IF($B$66=13,Y136,\"\")),\"\"),\"\")","v":""},null,"Trèfle blanc",3,3,2,1,1,0,3,3,2.5,3,1,1,0.5,1,3,1,1,{"$f":"IF($AW$115=13,BB136,\"\")","v":""}]
["Echauffement, légèrement brun",null,null,0,3,0,1,null,null,{"$f":"IF(G137=2,D137,IF(G137=3,D138,0))","v":0},{"$f":"IF(G137=2,D137,IF(G137=3,D138,0))","v":0},{"$f":"IF(G137=2,E137,IF(G137=3,E138,0))","v":0},{"$f":"IF(G137=2,F137,IF(H137=3,F138,0))","v":0},null,"Trèfle violet",0,3,3,2,0,-2,-1,-1,-1,-3,{"$f":"IF($P$121=2,IF($P$122=2,IF($AC$145=0,\"\",IF($B$66=14,P137,\"\")),\"\"),\"\")","v":""},{"$f":"IF($P$121=2,IF($P$122=3,IF($AC$145=0,\"\",IF($B$66=14,Q137,\"\")),\"\"),\"\")","v":""},{"$f":"IF($P$121=2,IF($P$122=4,IF($AC$145=0,\"\",IF($B$66=14,R137,\"\")),\"\"),\"\")","v":""},{"$f":"IF($P$121=2,IF($P$122=5,IF($AC$145=0,\"\",IF($B$66=14,S137,\"\")),\"\"),\"\")","v":""},{"$f":"IF($P$121=2,IF($P$122=6,IF($AC$145=0,\"\",IF($B$66=14,T137,\"\")),\"\"),\"\")","v":""},{"$f":"IF($P$121=3,IF($P$122=2,IF($AC$145=0,\"\",IF($B$66=14,U137,\"\")),\"\"),\"\")","v":""},{"$f":"IF($P$121=3,IF($P$122=3,IF($AC$145=0,\"\",IF($B$66=14,V137,\"\")),\"\"),\"\")","v":""},{"$f":"IF($P$121=3,IF($P$122=4,IF($AC$145=0,\"\",IF($B$66=14,W137,\"\")),\"\"),\"\")","v":""},{"$f":"IF($P$121=3,IF($P$122=5,IF($AC$145=0,\"\",IF($B$66=14,X137,\"\")),\"\"),\"\")","v":""},{"$f":"IF($P$121=3,IF($P$122=6,IF($AC$145=0,\"\",IF($B$66=14,Y137,\"\")),\"\"),\"\")","v":""},null,"Trèfle violet",3,3,2,-1,-1,-1,3,3,2.5,3,-1,-1,-1,-1,3,-1,-1,{"$f":"IF($AW$115=14,BB137,\"\")","v":""}]
["Echauffement, brun odeur de roussi",null,null,-5,-1,-2,null,null,"foins / regains",null,null,null,null,null,"Luzerne",1,1,1,1,1,-3,-2,-1,-2,-1,{"$f":"IF($P$121=2,IF($P$122=2,IF($AC$145=0,\"\",IF($B$66=15,P138,\"\")),\"\"),\"\")","v":""},{"$f":"IF($P$121=2,IF($P$122=3,IF($AC$145=0,\"\",IF($B$66=15,Q138,\"\")),\"\"),\"\")","v":""},{"$f":"IF($P$121=2,IF($P$122=4,IF($AC$145=0,\"\",IF($B$66=15,R138,\"\")),\"\"),\"\")","v":""},{"$f":"IF($P$121=2,IF($P$122=5,IF($AC$145=0,\"\",IF($B$66=15,S138,\"\")),\"\"),\"\")","v":""},{"$f":"IF($P$121=2,IF($P$122=6,IF($AC$145=0,\"\",IF($B$66=15,T138,\"\")),\"\"),\"\")","v":""},{"$f":"IF($P$121=3,IF($P$122=2,IF($AC$145=0,\"\",IF($B$66=15,U138,\"\")),\"\"),\"\")","v":""},{"$f":"IF($P$121=3,IF($P$122=3,IF($AC$145=0,\"\",IF($B$66=15,V138,\"\")),\"\"),\"\")","v":""},{"$f":"IF($P$121=3,IF($P$122=4,IF($AC$145=0,\"\",IF($B$66=15,W138,\"\")),\"\"),\"\")","v":""},{"$f":"IF($P$121=3,IF($P$122=5,IF($AC$145=0,\"\",IF($B$66=15,X138,\"\")),\"\"),\"\")","v":""},{"$f":"IF($P$121=3,IF($P$122=6,IF($AC$145=0,\"\",IF($B$66=15,Y138,\"\")),\"\"),\"\")","v":""},null,"Luzerne",1,1,1,-2,-1,-2,1,1,1,1,-1.5,-1.5,-1.5,-1.5,1,-1.5,-1.5,{"$f":"IF($AW$115=15,BB138,\"\")","v":""}]
[null,null,null,null,null,null,null,null,"% corrections",{"$f":"SUM(J134,J135,J137)/100","v":0},{"$f":"SUM(K134,K135,K137)/100","v":0},{"$f":"SUM(L134,L135,L137)/100","v":0},{"$f":"SUM(M134,M135,M137)/100","v":0},null,"indéterminé",5,5,5,4,4,-3,-3,-4,-3,-3,{"$f":"IF($P$121=2,IF($P$122=2,IF($AC$145=0,\"\",IF($B$66=8,P139,\"\")),\"\"),\"\")","v":""},{"$f":"IF($P$121=2,IF($P$122=3,IF($AC$145=0,\"\",IF($B$66=8,Q139,\"\")),\"\"),\"\")","v":""},{"$f":"IF($P$121=2,IF($P$122=4,IF($AC$145=0,\"\",IF($B$66=8,R139,\"\")),\"\"),\"\")","v":""},{"$f":"IF($P$121=2,IF($P$122=5,IF($AC$145=0,\"\",IF($B$66=8,S139,\"\")),\"\"),\"\")","v":""},{"$f":"IF($P$121=2,IF($P$122=6,IF($AC$145=0,\"\",IF($B$66=8,T139,\"\")),\"\"),\"\")","v":""},{"$f":"IF($P$121=3,IF($P$122=2,IF($AC$145=0,\"\",IF($B$66=8,U139,\"\")),\"\"),\"\")","v":""},{"$f":"IF($P$121=3,IF($P$122=3,IF($AC$145=0,\"\",IF($B$66=8,V139,\"\")),\"\"),\"\")","v":""},{"$f":"IF($P$121=3,IF($P$122=4,IF($AC$145=0,\"\",IF($B$66=8,W139,\"\")),\"\"),\"\")","v":""},{"$f":"IF($P$121=3,IF($P$122=5,IF($AC$145=0,\"\",IF($B$66=8,X139,\"\")),\"\"),\"\")","v":""},{"$f":"IF($P$121=3,IF($P$122=6,IF($AC$145=0,\"\",IF($B$66=8,Y139,\"\")),\"\"),\"\")","v":""},null,"indéterminé",5,5,4,-3,-4,-3,5,5,4.5,5,-3.5,-3.5,-3.5,-3.5,5,-3.5,-3.5,{"$f":"IF($AW$115=8,BB139,\"\")","v":""}]
[null,null,null,null,null,null,null,"corrections",{"$f":"INDEX(A61:A64,B60)","v":"Grünfutter"},{"$f":"IF(B60=2,J131,IF(B60=3,J139,0))","v":0},{"$f":"IF(B60=2,K131,IF(B60=3,K139,0))","v":0},{"$f":"IF(B60=2,L131,IF(B60=3,L139,0))","v":0},{"$f":"IF(B60=2,M131,IF(B60=3,M139,0))","v":0}]
[{"$f":"CONCATENATE(B60,B66)","v":"11"}]
[]
[null,null,null,null,null,null,null,null,null,null,null,null,null,null,null,null,null,null,null,null,"données MA,CB existantes"]
["EQUATIONS dMO et ADF, NDF, Sucres",null,null,null,null,null,null,null,null,null,null,null,null,null,null,"priorité ADF donné",null,null,null,null,null,{"$f":"SUM(N109:N110)","v":0},null,null,"conserve","bota",{"$f":"ISERROR(AA145)","v":false},"dMO donné prioritaire","dMO utilisée","dMO pour correction cycle-stade","ADFreg","ADFreg","NDFreg","NDFreg","SUCREreg","SUCREreg"]
[null,null,null,"MA","CB","ADF donné","NDF donné","CE","ADF reg2006","NDF reg","sucre reg","NDF(donné/reg)","ADF(donné/reg)","MO","MA/MO","CB/MO","ADF/MO","MA2/MO","CB2/MO","ADF2/MO","dMO par CB","dMO par ADF","LV99","dMO reg",null,null,{"$f":"SUM(AA146:AA209)","v":0},"dMO",{"$f":"IF(AA144=TRUE,\"\",IF(G13<>AA145,G13,AA145))","v":""},{"$f":"IF(Y120=0,AC145,Y120)","v":{"$error":"#VALUE!"}},null,{"$f":"(SUM(AF146:AF209))*G2/100","v":0},null,{"$f":"(SUM(AH146:AH209))*G2/100","v":0},null,{"$f":"(SUM(AJ146:AJ209))*G2/100","v":0}]
[null,"vert","G",{"$f":"$J$109","v":0},{"$f":"$J$110","v":0},{"$f":"$J$112","v":0},{"$f":"$J$113","v":0},{"$f":"$J$111","v":0},{"$f":"IF(E146=0,\"\",1.0503*E146 + 18.642)","v":""},{"$f":"IF(E146=0,\"\", 1.753*E146 + 40.45)","v":""},{"$f":"IF(E146=0,\"\", -0.0035*E146^2 + 1.7676*E146 - 115.4)","v":""},{"$f":"IF(G146=\"\",J146,G146)","v":0},{"$f":"IF(F146=\"\",I146,F146)","v":0},{"$f":"1000-H146","v":1000},{"$f":"D146/N146*1000","v":0},{"$f":"E146/N146*1000","v":0},{"$f":"M146/N146*1000","v":0},{"$f":"O146^2","v":0},{"$f":"P146^2","v":0},{"$f":"Q146^2","v":0},{"$f":"IF(E146=0,\"\",34+0.1654*O146+0.1776*P146-0.000257*R146-0.000391*S146)","v":""},{"$f":"IF(M146=0,\"\",25.7+0.1654*O146+0.2169*Q146-0.000256*R146-0.000413*T146)","v":""},{"$f":"IF(V144=0,\"\",84.8+0.0109*O146-0.000167*S146)","v":""},{"$f":"IF($J$60=1,U146,IF($J$60=2,V146,W146))","v":""},{"$f":"IF(X146=U146,\"dMO par CB\",IF(X146=V146,\"dMO par ADF\",\"dMO reg LV99\"))","v":"dMO par CB"},{"$f":"IF($C$60=\"VER\",X146,\"\")","v":""},{"$f":"IF($C$66=\"G\",Z146,0)","v":""},"G",null,null,{"$f":"IF($C$60=\"VER\",I146,\"\")","v":""},{"$f":"IF($C$66=\"G\",AE146,0)","v":""},{"$f":"IF($C$60=\"VER\",J146,\"\")","v":""},{"$f":"IF($C$66=\"G\",AG146,0)","v":""},{"$f":"IF($C$60=\"VER\",K146,\"\")","v":""},{"$f":"IF($C$66=\"G\",AI146,0)","v":""}]
[null,"vert","GR",0,0,0,0,0,{"$f":"IF(E147=0,\"\", 1.0649*E147 + 14.478)","v":""},{"$f":"IF(E147=0,\"\", 1.913*E147 - 1.668)","v":""},{"$f":"IF(E147=0,\"\", 0.0037*E147^2 - 1.8885*E147 + 396.24)","v":""},{"$f":"IF(G147=\"\",J147,G147)","v":0},{"$f":"IF(F147=\"\",I147,F147)","v":0},1000,0,0,{"$f":"M147/N147*1000","v":0},{"$f":"O147^2","v":0},0,0,{"$f":"IF(E147=0,\"\",21.9+0.1209*O147+0.358*P147-0.000186*R147-0.000794*S147)","v":""},{"$f":"IF(M147=0,\"\",13.3+0.1209*O147+0.3823*Q147-0.000186*R147-0.000746*T147)","v":""},{"$f":"IF(V144=0,\"\",87.9+0.0006*O147+0.0028*P147-0.000179*S147)","v":""},"",{"$f":"IF(X147=U147,\"dMO par CB\",IF(X147=V147,\"dMO par ADF\",\"dMO reg LV99\"))","v":"dMO par CB"},"",{"$f":"IF($C$66=\"GR\",Z147,0)","v":0},"GR",null,null,"",{"$f":"IF($C$66=\"GR\",AE147,0)","v":0},"",{"$f":"IF($C$66=\"GR\",AG147,0)","v":0},"",{"$f":"IF($C$66=\"GR\",AI147,0)","v":0}]
[null,"vert","E ",0,0,0,0,0,{"$f":"IF(E148=0,\"\", 1.0238*E148 + 29.95)","v":""},{"$f":"IF(E148=0,\"\", 1.7735*E148 + 20.628)","v":""},{"$f":"IF(E148=0,\"\", -0.0027*E148^2 + 1.2332*E148 - 27.716)","v":""},{"$f":"IF(G148=\"\",J148,G148)","v":0},0,1000,0,0,0,0,0,0,{"$f":"IF(E148=0,\"\",40.6+0.1599*O148+0.1431*P148-0.000248*R148-0.000351*S148)","v":""},{"$f":"IF(M148=0,\"\",32.3+0.1599*O148+0.1866*Q148-0.000248*R148-0.000382*T148)","v":""},{"$f":"IF(V144=0,\"\",83.5+0.0114*O148-0.000145*S148)","v":""},"","dMO par CB","",{"$f":"IF($C$66=\"E\",Z148,0)","v":0},"E ",null,null,"",{"$f":"IF($C$66=\"E\",AE148,0)","v":0},"",{"$f":"IF($C$66=\"E\",AG148,0)","v":0},"",{"$f":"IF($C$66=\"E\",AI148,0)","v":0}]
[null,"vert","ER ",0,0,0,0,0,{"$f":"IF(E149=0,\"\", 1.0747*E149 + 18.157)","v":""},{"$f":" IF(E149=0,\"\",1.9227*E149 - 15.022)","v":""},{"$f":"IF(E149=0,\"\", 0.0008*E149^2 - 0.4282*E149 + 201.3)","v":""},0,0,1000,0,0,0,0,0,0,{"$f":"IF(E149=0,\"\",43.2+0.0859*O149+0.2559*P149-0.000132*R149-0.000678*S149)","v":""},{"$f":"IF(M149=0,\"\",34.4+0.0863*O149+0.2914*Q149-0.000133*R149-0.000647*T149)","v":""},{"$f":"IF(V144=0,\"\",94.4+0.0011*O149-0.0466*P149-0.000075*S149)","v":""},"","dMO par CB","",{"$f":"IF($C$66=\"ER\",Z149,0)","v":0},"ER ",null,null,"",{"$f":"IF($C$66=\"ER\",AE149,0)","v":0},"",{"$f":"IF($C$66=\"ER\",AG149,0)","v":0},"",{"$f":"IF($C$66=\"ER\",AI149,0)","v":0}]
[null,"vert","L ",0,0,0,0,0,{"$f":"IF(E150=0,\"\", 1.0964*E150 + 22.686)","v":""},{"$f":"IF(E150=0,\"\", 1.5566*E150 + 34.674)","v":""},{"$f":"IF(E150=0,\"\", -0.0013*E150^2 + 0.666*E150 + 36.244)","v":""},0,0,1000,0,0,0,0,0,0,{"$f":"IF(E150=0,\"\",86-0.000231*S150)","v":""},{"$f":"IF(M150=0,\"\",87.4-0.000179*T150)","v":""},{"$f":"IF(V144=0,\"\",72.6+0.0035*O150+0.1206*P150-0.000435*S150)","v":""},"","dMO par CB","",{"$f":"IF($C$66=\"L\",Z150,0)","v":0},"L ",null,null,"",{"$f":"IF($C$66=\"L\",AE150,0)","v":0},"",{"$f":"IF($C$66=\"L\",AG150,0)","v":0},"",{"$f":"IF($C$66=\"L\",AI150,0)","v":0}]
[null,"vert","DF ",0,0,0,0,0,{"$f":"IF(E151=0,\"\", 1.1167*E151 + 24.749)","v":""},{"$f":"IF(E151=0,\"\", 1.9332*E151 - 31.121)","v":""},{"$f":"IF(E151=0,\"\", 0.0035*E151^2 - 1.3962*E151 + 265.53)","v":""},0,0,1000,0,0,0,0,0,0,{"$f":"IF(E151=0,\"\",58.9+0.0792*O151+0.132*P151-0.000121*R151-0.000428*S151)","v":""},{"$f":"IF(M151=0,\"\",48.6+0.0779*O151+0.2008*Q151-0.000118*R151-0.000487*T151)","v":""},{"$f":"IF(V144=0,\"\",174.6-0.1409*O151-0.4803*P151+0.000543*S151)","v":""},"","dMO par CB","",{"$f":"IF($C$66=\"DF\",Z151,0)","v":0},"DF ",null,null,"",{"$f":"IF($C$66=\"DF\",AE151,0)","v":0},"",{"$f":"IF($C$66=\"DF\",AG151,0)","v":0},"",{"$f":"IF($C$66=\"DF\",AI151,0)","v":0}]
[null,"vert","DT ",0,0,0,0,0,{"$f":"IF(E152=0,\"\", 1.1896*E152 + 14.282)","v":""},{"$f":"IF(E152=0,\"\", 1.9337*E152 - 32.211)","v":""},{"$f":"IF(E152=0,\"\", 0.0011*E152^2 - 0.6024*E152 + 209.31)","v":""},0,0,1000,0,0,0,0,0,0,{"$f":"IF(E152=0,\"\",43.6+0.1806*O152+0.1384*P152-0.000298*R152-0.000475*S152)","v":""},{"$f":"IF(M152=0,\"\",35.2+0.1813*O152+0.1512*Q152-0.000299*R152-0.000311*T152)","v":""},{"$f":"IF(V144=0,\"\",174.6-0.1409*O152-0.4803*P152+0.000543*S152)","v":""},"","dMO par CB","",{"$f":"IF($C$66=\"DT\",Z152,0)","v":0},"DT ",null,null,"",{"$f":"IF($C$66=\"DT\",AE152,0)","v":0},"",{"$f":"IF($C$66=\"DT\",AG152,0)","v":0},"",{"$f":"IF($C$66=\"DT\",AI152,0)","v":0}]
[null,"vert","IND ",0,0,0,0,0,{"$f":"IF(E153=0,\"\", 0.9296*E153 + 55.229)","v":""},{"$f":"IF(E153=0,\"\", 1.8457*E153 - 10.667)","v":""},{"$f":"IF(E153=0,\"\", -0.0074*E153^2 + 3.2716*E153 - 221.76)","v":""},0,0,1000,0,0,0,0,0,0,{"$f":"IF(E153=0,\"\",56.7+0.1262*O153+0.0939*P153-0.000231*R153-0.000312*S153)","v":""},{"$f":"IF(M153=0,\"\",54.8+0.1121*O153+0.1221*Q153-0.000207*R153-0.000335*T153)","v":""},{"$f":"IF(V144=0,\"\",72.7+0.0291*O153+0.0481*P153-0.000211*S153)","v":""},"","dMO par CB","",{"$f":"IF($C$66=\"INC\",Z153,0)","v":0},"IND ",null,null,"",{"$f":"IF($C$66=\"INC\",AE153,0)","v":0},"",{"$f":"IF($C$66=\"INC\",AG153,0)","v":0},"",{"$f":"IF($C$66=\"INC\",AI153,0)","v":0}]
[null,"vert","dg",0,0,0,0,0,{"$f":"IF(E154=0,\"\", 0.9853*E154 + 28.437)","v":""},{"$f":"IF(E154=0,\"\", 1.3785*E154 + 156.77)","v":""},{"$f":"IF(E154=0,\"\", -0.0086*E154^2 + 5.0791*E154 - 639.52)","v":""},0,0,1000,0,0,0,0,0,0,{"$f":"IF(E154=0,\"\",93.6-0.000221*S154)","v":""},{"$f":"IF(M154=0,\"\",96.3-0.000212*T154)","v":""},null,"","dMO par CB","",{"$f":"IF($C$66=\"dg\",Z154,0)","v":0},"dg",null,null,"",{"$f":"IF($C$66=\"dg\",AE154,0)","v":0},"",{"$f":"IF($C$66=\"dg\",AG154,0)","v":0},"",{"$f":"IF($C$66=\"dg\",AI154,0)","v":0}]
[null,"vert","lp",0,0,0,0,0,{"$f":"IF(E155=0,\"\", 2.106*E155 - 35.434)","v":""},{"$f":"IF(E155=0,\"\", 1.1817*E155 - 20.908)","v":""},{"$f":"IF(E155=0,\"\", 0.0136*E155^2 - 7.0911*E155 + 1098.3)","v":""},0,0,1000,0,0,0,0,0,0,{"$f":"IF(E155=0,\"\",95.5+0.0122*O155-0.000316*S155)","v":""},{"$f":"IF(M155=0,\"\",98.3+0.0013*O155-0.000279*T155)","v":""},{"$f":"IF(W144=0,\"\",74.4+0.0085*O155+0.1103*P155-0.000411*S155)","v":""},"","dMO par CB","",{"$f":"IF($C$66=\"lp\",Z155,0)","v":0},"lp",{"$f":"IF($J$60=3,W161,0)","v":0},"dMOmaïs LV99","",{"$f":"IF($C$66=\"lp\",AE155,0)","v":0},"",{"$f":"IF($C$66=\"lp\",AG155,0)","v":0},"",{"$f":"IF($C$66=\"lp\",AI155,0)","v":0}]
[null,"vert","li",0,0,0,0,0,{"$f":"IF(E156=0,\"\", 1.2035*E156 - 16.67)","v":""},{"$f":"IF(E156=0,\"\", 1.7517*E156 + 47.237)","v":""},{"$f":"IF(E156=0,\"\", -0.001*E156^2 + 0.3864*E156 + 171.38)","v":""},0,0,1000,0,0,0,0,0,0,{"$f":"IF(E156=0,\"\",101.7-0.000446*S156)","v":""},{"$f":"IF(M156=0,\"\",101.1-0.000339*T156)","v":""},{"$f":"IF(W144=0,\"\",74.4+0.0085*O156+0.1103*P156-0.000411*S156)","v":""},"","dMO par CB","",{"$f":"IF($C$66=\"li\",Z156,0)","v":0},"li",{"$f":"IF(AND($A$84=4,$J$60=1),U161,0)","v":0},"dMOmaïs LV06 par CB (INRA)","",{"$f":"IF($C$66=\"li\",AE156,0)","v":0},"",{"$f":"IF($C$66=\"li\",AG156,0)","v":0},"",{"$f":"IF($C$66=\"li\",AI156,0)","v":0}]
[null,"vert","ap",0,0,0,0,0,{"$f":"IF(E157=0,\"\", 1.2025*E157 - 25.099)","v":""},{"$f":"IF(E157=0,\"\", 2.1605*E157 - 53.052)","v":""},{"$f":"IF(E157=0,\"\", 0.0044*E157^2 - 2.8995*E157 + 547.51)","v":""},0,0,1000,0,0,0,0,0,0,{"$f":"IF(E157=0,\"\",90.1+0.0414*O157-0.000309*S157)","v":""},{"$f":"IF(M157=0,\"\",98.6+0.0144*O157-0.000282*T157)","v":""},null,"","dMO par CB","",{"$f":"IF($C$66=\"ap\",Z157,0)","v":0},"ap",{"$f":"IF(AND($A$84=4,$J$60=2),U161,0)","v":0},"dMO maïs LV06 par ADFNDF (INRA)","",{"$f":"IF($C$66=\"ap\",AE157,0)","v":0},"",{"$f":"IF($C$66=\"ap\",AG157,0)","v":0},"",{"$f":"IF($C$66=\"ap\",AI157,0)","v":0}]
[null,"vert","tr",0,0,0,0,0,{"$f":"IF(E158=0,\"\", 1.2727*E158 + 8.4545)","v":""},{"$f":"IF(E158=0,\"\", 1.5973*E158 - 9.5709)","v":""},{"$f":"IF(E158=0,\"\", -0.0069*E158^2 + 2.2686*E158 - 100.25)","v":""},0,0,1000,0,0,0,0,0,0,{"$f":"IF(E158=0,\"\",58.2+0.0732*O158-0.000022*S158)","v":""},{"$f":"IF(M158=0,\"\",61.7+0.0642*O158-0.00003*T158)","v":""},null,"","dMO par CB","",{"$f":"IF($C$66=\"tr\",Z158,0)","v":0},"tr",{"$f":"IF(AND($A$84=1,$J$60=1),100*((((N161*U161/100)*1.2812)-180.35)/N161),0)","v":{"$error":"#VALUE!"}},"dMOmaïscorr. Par MOD dMOCB: 1.2812 x MOD CB -180.35","",{"$f":"IF($C$66=\"tr\",AE158,0)","v":0},"",{"$f":"IF($C$66=\"tr\",AG158,0)","v":0},"",{"$f":"IF($C$66=\"tr\",AI158,0)","v":0}]
[null,"vert","tp",0,0,0,0,0,{"$f":"IF(E159=0,\"\", 1.125*E159 + 20.242)","v":""},{"$f":"IF(E159=0,\"\", 1.3119*E159 + 58.139)","v":""},{"$f":"IF(E159=0,\"\", -0.0004*E159^2 + 0.0843*E159 +101.68)","v":""},0,0,1000,0,0,0,0,0,0,{"$f":"IF(E159=0,\"\",78.8+0.000047*R159-0.000154*S159)","v":""},{"$f":"IF(M159=0,\"\",80.2+0.000041*R159-0.000118*T159)","v":""},null,"","dMO par CB","",{"$f":"IF($C$66=\"tp\",Z159,0)","v":0},"tp",{"$f":"IF(AND($A$84=1,$J$60=2),100*((((N161*V161/100)*1.2653)-156.12)/N161),0)","v":0},"dMOmaïs corr. Par MOD dMOADF : 1.2653 x MOD ADF - 156.12","",{"$f":"IF($C$66=\"tp\",AE159,0)","v":0},"",{"$f":"IF($C$66=\"tp\",AG159,0)","v":0},"",{"$f":"IF($C$66=\"tp\",AI159,0)","v":0}]
[null,"vert","luz",0,0,0,0,0,{"$f":" IF(E160=0,\"\",1.0526*E160 + 34.944)","v":""},{"$f":"IF(E160=0,\"\", 1.2979*E160 + 32.529)","v":""},{"$f":"IF(E160=0,\"\", -0.00004*E160^2 - 0.0411*E160 + 71.168)","v":""},0,0,1000,0,0,0,0,0,0,{"$f":"IF(E160=0,\"\",52.4+0.0898*O160-0.000062*S160)","v":""},{"$f":"IF(M160=0,\"\",56.7+0.0796*O160-0.00006*T160)","v":""},{"$f":"IF(W144=0,\"\",100.1-0.0989*P160)","v":""},"","dMO par CB","",{"$f":"IF($C$66=\"LUZ\",Z160,0)","v":0},"luz",{"$f":"IF(AND($A$84=2,$J$60<3),100*((-1016.7+($J$115*1.8)+(($J$109*$J$117/1000)*1.106)+(($M$109*$M$115/1000)*(-3.01))+(($M$110*$M$111/1000)*(-0.0013))+10.3)/$J$115),0)","v":0},"dMOmaïs PE équation ALP12","",{"$f":"IF($C$66=\"LUZ\",AE160,0)","v":0},"",{"$f":"IF($C$66=\"LUZ\",AG160,0)","v":0},"",{"$f":"IF($C$66=\"LUZ\",AI160,0)","v":0}]
[null,"vert","maïs",0,0,0,0,0,{"$f":"IF(E161=0,\"\", 1.0966*E161 + 16.236)","v":""},{"$f":"IF(E161=0,\"\",1.5282*E161 + 125.25)","v":""},{"$f":"IF(E161=0,\"\", 0.2348*E161 + 4.8502)","v":""},0,0,1000,0,0,0,0,0,0,{"$f":"IF(E161=0,\"\",79.4+0.0652*O161-0.0591*P161)","v":""},{"$f":"IF(M161=0,\"\",IF(L161=0,\"\",75.7+0.0701*O161+0.0156*L161/N161*1000-0.072*Q161))","v":""},{"$f":"IF(W144=0,\"\",82.5+0.0758*O161-0.0729*P161)","v":""},"","dMO par CB","",{"$f":"IF(Z161=\"\",\"\",IF($C$66=\"MAIS\",SUM(AC155:AC161),0))","v":""},"maïs",{"$f":"IF(AND($A$84=3,$J$60<3),100*((-1016.7+($J$115*1.8)+(($J$109*$J$117/1000)*1.106)+(($M$109*$M$115/1000)*(-3.01))+(($M$110*$M$111/1000)*(-0.0013))-10.3)/$J$115),0)","v":0},"dMOmaïs pas PE équation ALP12","",{"$f":"IF($C$66=\"MAIS\",AE161,0)","v":0},"",{"$f":"IF($C$66=\"MAIS\",AG161,0)","v":0},"",{"$f":"IF($C$66=\"MAIS\",AI161,0)","v":0}]
[null,"ensilé","G",0,0,0,0,0,{"$f":"IF(E162=0,\"\", 0.9982*E162 + 38.072)","v":""},{"$f":"IF(E162=0,\"\", 1.5508*E162 + 35.621)","v":""},{"$f":"IF(E162=0,\"\", -0.0017*E162^2 + 0.9258*E162 - 84.881)","v":""},0,0,1000,0,0,0,0,0,0,{"$f":"IF(E162=0,\"\",26.3+0.1653*O162+0.2041*P162-0.000241*R162-0.000419*S162)","v":""},{"$f":"IF(M162=0,\"\",10.8+0.1652*O162+0.2793*Q162-0.00024*R162-0.000484*T162)","v":""},{"$f":"IF(V144=0,\"\",110.8-0.000032*R162-0.1298*P162)","v":""},"","dMO par CB",{"$f":"IF($C$60=\"ENS\",X162,\"\")","v":""},{"$f":"IF($C$66=\"G\",Z162,0)","v":""},"G",null,null,{"$f":"IF($C$60=\"ENS\",I162,\"\")","v":""},{"$f":"IF($C$66=\"G\",AE162,0)","v":""},{"$f":"IF($C$60=\"ENS\",J162,\"\")","v":""},{"$f":"IF($C$66=\"G\",AG162,0)","v":""},{"$f":"IF($C$60=\"ENS\",K162,\"\")","v":""},{"$f":"IF($C$66=\"G\",AI162,0)","v":""}]
[null,"ensilé","GR",0,0,0,0,0,{"$f":"IF(E163=0,\"\", 1.0241*E163 + 30.808)","v":""},{"$f":"IF(E163=0,\"\", 1.7027*E163 - 6.0565)","v":""},{"$f":" IF(E163=0,\"\",0.0017*E163^2 - 0.8951*E163 + 178.35)","v":""},0,0,1000,0,0,0,0,0,0,{"$f":"IF(E163=0,\"\",10.4+0.1206*O163+0.4102*P163-0.000174*R163-0.000849*S163)","v":""},{"$f":"IF(M163=0,\"\",-9.4+0.1206*O163+0.4916*Q163-0.000174*R163-0.000872*T163)","v":""},{"$f":"IF(V144=0,\"\",94.1-0.0067*O163-0.0262*P163-0.000141*S163)","v":""},"","dMO par CB",{"$f":"IF($C$60=\"ENS\",X163,\"\")","v":""},{"$f":"IF($C$66=\"GR\",Z163,0)","v":0},"GR",null,null,"",{"$f":"IF($C$66=\"GR\",AE163,0)","v":0},"",{"$f":"IF($C$66=\"GR\",AG163,0)","v":0},"",{"$f":"IF($C$66=\"GR\",AI163,0)","v":0}]
[null,"ensilé","E ",0,0,0,0,0,{"$f":"IF(E164=0,\"\", 1.0005*E164 + 42.48)","v":""},{"$f":"IF(E164=0,\"\", 1.6001*E164 + 10.376)","v":""},{"$f":"IF(E164=0,\"\", -0.0005*E164^2 + 0.2288*E164 +16.541)","v":""},0,0,1000,0,0,0,0,0,0,{"$f":"IF(E164=0,\"\",34.1+0.1596*O164+0.1653*P164-0.000233*R164-0.000376*S164)","v":""},{"$f":"IF(M164=0,\"\",19.4+0.1596*O164+0.2424*Q164-0.000232*R164-0.000447*T164)","v":""},{"$f":"IF(V144=0,\"\",122.1-0.0423*O164-0.1478*P164)","v":""},"","dMO par CB","",{"$f":"IF($C$66=\"E\",Z164,0)","v":0},"E ",null,null,"",{"$f":"IF($C$66=\"E\",AE164,0)","v":0},"",{"$f":"IF($C$66=\"E\",AG164,0)","v":0},"",{"$f":"IF($C$66=\"E\",AI164,0)","v":0}]
[null,"ensilé","ER ",0,0,0,0,0,{"$f":"IF(E165=0,\"\", 1.026*E165 + 35.952)","v":""},{"$f":"IF(E165=0,\"\", 1.7144*E165 - 17.949)","v":""},{"$f":"IF(E165=0,\"\", 0.0001*E165^2 - 0.081*E165 + 68.852)","v":""},0,0,1000,0,0,0,0,0,0,{"$f":"IF(E165=0,\"\",34.9+0.0857*O165+0.2967*P165-0.000124*R165-0.000724*S165)","v":""},{"$f":"IF(M165=0,\"\",16.9+0.0864*O165+0.3815*Q165-0.000125*R165-0.000755*T165)","v":""},{"$f":"IF(V144=0,\"\",95.4-0.0002*O165-0.0513*P165-0.000068*S165)","v":""},"","dMO par CB","",{"$f":"IF($C$66=\"ER\",Z165,0)","v":0},"ER ",null,null,"",{"$f":"IF($C$66=\"ER\",AE165,0)","v":0},"",{"$f":"IF($C$66=\"ER\",AG165,0)","v":0},"",{"$f":"IF($C$66=\"ER\",AI165,0)","v":0}]
[null,"ensilé","L ",0,0,0,0,0,{"$f":"IF(E166=0,\"\", 1.0405*E166 + 41.457)","v":""},{"$f":"IF(E166=0,\"\", 1.369*E166 + 34.55)","v":""},{"$f":"IF(E166=0,\"\", 0.00003*E166^2 -0.051*E166 + 53.265)","v":""},0,0,1000,0,0,0,0,0,0,{"$f":"IF(E166=0,\"\",85.8-0.000229*S166)","v":""},{"$f":"IF(M166=0,\"\",88.3-0.000181*T166)","v":""},{"$f":"IF(V144=0,\"\",70.4+0.0086*O166+0.1247*P166-0.000436*S166)","v":""},"","dMO par CB","",{"$f":"IF($C$66=\"L\",Z166,0)","v":0},"L ",null,null,"",{"$f":"IF($C$66=\"L\",AE166,0)","v":0},"",{"$f":"IF($C$66=\"L\",AG166,0)","v":0},"",{"$f":"IF($C$66=\"L\",AI166,0)","v":0}]
[null,"ensilé","DF ",0,0,0,0,0,{"$f":"IF(E167=0,\"\",1.0842*E167 + 38.447)","v":""},{"$f":"IF(E167=0,\"\", 1.7333*E167 - 34.721)","v":""},{"$f":"IF(E167=0,\"\", 0.0015*E167^2 - 0.6373*E167 + 114.42)","v":""},0,0,1000,0,0,0,0,0,0,{"$f":"IF(E167=0,\"\",54+0.078*O167+0.1557*P167-0.000111*R167-0.000457*S167)","v":""},{"$f":"IF(M167=0,\"\",36.1+0.0759*O167+0.268*Q167-0.000107*R167-0.000572*T167)","v":""},{"$f":"IF(V144=0,\"\",122.4-0.0213*O167-0.2763*P167+0.000294*S167)","v":""},"","dMO par CB","",{"$f":"IF($C$66=\"DF\",Z167,0)","v":0},"DF ",null,null,"",{"$f":"IF($C$66=\"DF\",AE167,0)","v":0},"",{"$f":"IF($C$66=\"DF\",AG167,0)","v":0},"",{"$f":"IF($C$66=\"DF\",AI167,0)","v":0}]
[null,"ensilé","DT ",0,0,0,0,0,{"$f":"IF(E168=0,\"\", 1.1428*E168 + 29.545)","v":""},{"$f":"IF(E168=0,\"\", 1.7401*E168 - 37.006)","v":""},{"$f":"IF(E168=0,\"\", 0.0008*E168^2 - 0.3693*E168 + 94.79)","v":""},0,0,1000,0,0,0,0,0,0,{"$f":"IF(E168=0,\"\",37.4+0.1809*O168+0.1622*P168-0.00028*R168-0.0005*S168)","v":""},{"$f":"IF(M168=0,\"\",24.2+0.1819*O168+0.1929*Q168-0.000282*R168-0.000355*T168)","v":""},{"$f":"IF(V144=0,\"\",122.4-0.0213*O168-0.2763*P168+0.000294*S168)","v":""},"","dMO par CB","",{"$f":"IF($C$66=\"DT\",Z168,0)","v":0},"DT ",null,null,"",{"$f":"IF($C$66=\"DT\",AE168,0)","v":0},"",{"$f":"IF($C$66=\"DT\",AG168,0)","v":0},"",{"$f":"IF($C$66=\"DT\",AI168,0)","v":0}]
[null,"ensilé","IND ",0,0,0,0,0,{"$f":"IF(E169=0,\"\", 0.8941*E169 + 68.218)","v":""},{"$f":"IF(E169=0,\"\", 1.6092*E169 + 18.402)","v":""},{"$f":"IF(E169=0,\"\", -0.0031*E169^2 + 1.4524*E169 - 117.39)","v":""},0,0,1000,0,0,0,0,0,0,{"$f":"IF(E169=0,\"\",51.8+0.1275*O169+0.1116*P169-0.000219*R169-0.000333*S169)","v":""},{"$f":"IF(M169=0,\"\",45.7+0.1145*O169+0.1661*Q169-0.000199*R169-0.00039*T169)","v":""},{"$f":"IF(V144=0,\"\",61.6+0.0386*O169+0.0965*P169-0.000274*S169)","v":""},"","dMO par CB","",{"$f":"IF($C$66=\"INC\",Z169,0)","v":0},"IND ",null,null,"",{"$f":"IF($C$66=\"INC\",AE169,0)","v":0},"",{"$f":"IF($C$66=\"INC\",AG169,0)","v":0},"",{"$f":"IF($C$66=\"INC\",AI169,0)","v":0}]
[null,"ensilé","dg",0,0,0,0,0,{"$f":"IF(E170=0,\"\", 0.9309*E170 + 50.049)","v":""},{"$f":"IF(E170=0,\"\", 1.2196*E170 + 143.54)","v":""},{"$f":"IF(E170=0,\"\", 0.0004*E170^2 -0.2612*E170 +82.006)","v":""},0,0,1000,0,0,0,0,0,0,{"$f":"IF(E170=0,\"\",94.5-0.000225*S170)","v":""},{"$f":"IF(M170=0,\"\",99.2-0.000224*T170)","v":""},null,"","dMO par CB","",{"$f":"IF($C$66=\"dg\",Z170,0)","v":0},"dg",null,null,"",{"$f":"IF($C$66=\"dg\",AE170,0)","v":0},"",{"$f":"IF($C$66=\"dg\",AG170,0)","v":0},"",{"$f":"IF($C$66=\"dg\",AI170,0)","v":0}]
[null,"ensilé","lp",0,0,0,0,0,{"$f":"IF(E171=0,\"\", 1.122*E171 - 0.7226)","v":""},{"$f":"IF(E171=0,\"\", 1.8755*E171 - 38.083)","v":""},{"$f":"IF(E171=0,\"\", 0.0064*E171^2 - 3.4633*E171 + 538.08)","v":""},0,0,1000,0,0,0,0,0,0,{"$f":"IF(E171=0,\"\",101.5-0.000352*S171)","v":""},{"$f":"IF(M171=0,\"\",102.2-0.000293*T171)","v":""},{"$f":"IF(W144=0,\"\",109.7-0.0205*O171-0.0766*P171-0.000151*S171)","v":""},"","dMO par CB","",{"$f":"IF($C$66=\"lp\",Z171,0)","v":0},"lp",{"$f":"IF($J$60=3,W177,0)","v":0},"dMOmaïs LV99","",{"$f":"IF($C$66=\"lp\",AE171,0)","v":0},"",{"$f":"IF($C$66=\"lp\",AG171,0)","v":0},"",{"$f":"IF($C$66=\"lp\",AI171,0)","v":0}]
[null,"ensilé","li",0,0,0,0,0,{"$f":"IF(E172=0,\"\", 1.1351*E172 + 4.7669)","v":""},{"$f":"IF(E172=0,\"\", 1.5509*E172 + 41.592)","v":""},{"$f":"IF(E172=0,\"\", -0.0005*E172^2 + 0.1982*E172 + 62.47)","v":""},0,0,1000,0,0,0,0,0,0,{"$f":"IF(E172=0,\"\",103.8-0.000449*S172)","v":""},{"$f":"IF(M172=0,\"\",104.1-0.000341*T172)","v":""},{"$f":"IF(W144=0,\"\",109.7-0.0205*O172-0.0766*P172-0.000151*S172)","v":""},"","dMO par CB","",{"$f":"IF($C$66=\"li\",Z172,0)","v":0},"li",{"$f":"IF(AND($A$84=4,$J$60=1),U177,0)","v":0},"dMOmaïs LV06 par CB (INRA)","",{"$f":"IF($C$66=\"li\",AE172,0)","v":0},"",{"$f":"IF($C$66=\"li\",AG172,0)","v":0},"",{"$f":"IF($C$66=\"li\",AI172,0)","v":0}]
[null,"ensilé","ap",0,0,0,0,0,{"$f":"IF(E173=0,\"\", 1.1742*E173 - 13.802)","v":""},{"$f":"IF(E173=0,\"\", 1.9325*E173 - 56.89)","v":""},{"$f":"IF(E173=0,\"\", 0.0016*E173^2 - 1.119*E173 + 218.21)","v":""},0,0,1000,0,0,0,0,0,0,{"$f":"IF(E173=0,\"\",86.1+0.0573*O173-0.000291*S173)","v":""},{"$f":"IF(M173=0,\"\",101.8+0.0173*O173-0.000293*T173)","v":""},null,"","dMO par CB","",{"$f":"IF($C$66=\"ap\",Z173,0)","v":0},"ap",{"$f":"IF(AND($A$84=4,$J$60=2),U177,0)","v":0},"dMO maïs LV06 par ADFNDF (INRA)","",{"$f":"IF($C$66=\"ap\",AE173,0)","v":0},"",{"$f":"IF($C$66=\"ap\",AG173,0)","v":0},"",{"$f":"IF($C$66=\"ap\",AI173,0)","v":0}]
[null,"ensilé","tr",0,0,0,0,0,{"$f":"IF(E174=0,\"\", 1.2468*E174 + 18.486)","v":""},{"$f":"IF(E174=0,\"\", 1.4135*E174 - 7.8475)","v":""},{"$f":"IF(E174=0,\"\", -0.0035*E174^2 + 1.2495*E174 - 80.005)","v":""},0,0,1000,0,0,0,0,0,0,{"$f":"IF(E174=0,\"\",86.5-0.000261*S174)","v":""},{"$f":"IF(M174=0,\"\",87.1-0.000152*T174)","v":""},null,"","dMO par CB","",{"$f":"IF($C$66=\"tr\",Z174,0)","v":0},"tr",{"$f":"IF(AND($A$84=1,$J$60=1),100*((((N177*U177/100)*1.2812)-180.35)/N177),0)","v":{"$error":"#VALUE!"}},"dMOmaïscorr. Par MOD dMOCB: 1.2812 x MOD CB -180.35","",{"$f":"IF($C$66=\"tr\",AE174,0)","v":0},"",{"$f":"IF($C$66=\"tr\",AG174,0)","v":0},"",{"$f":"IF($C$66=\"tr\",AI174,0)","v":0}]
[null,"ensilé","tp",0,0,0,0,0,{"$f":"IF(E175=0,\"\", 1.0699*E175 + 38.695)","v":""},{"$f":"IF(E175=0,\"\", 1.1597*E175 + 56.057)","v":""},{"$f":"IF(E175=0,\"\", -0.0001*E175^2 + 0.0244*E175 +37.2)","v":""},0,0,1000,0,0,0,0,0,0,{"$f":"IF(E175=0,\"\",82.5-0.000189*S175)","v":""},{"$f":"IF(M175=0,\"\",84.1-0.000141*T175)","v":""},null,"","dMO par CB","",{"$f":"IF($C$66=\"tp\",Z175,0)","v":0},"tp",{"$f":"IF(AND($A$84=1,$J$60=2),100*((((N177*V177/100)*1.2653)-156.12)/N177),0)","v":0},"dMOmaïs corr. Par MOD dMOADF : 1.2653 x MOD ADF - 156.12","",{"$f":"IF($C$66=\"tp\",AE175,0)","v":0},"",{"$f":"IF($C$66=\"tp\",AG175,0)","v":0},"",{"$f":"IF($C$66=\"tp\",AI175,0)","v":0}]
[null,"ensilé","luz",0,0,0,0,0,{"$f":"IF(E176=0,\"\", 1.0188*E176 + 49.137)","v":""},{"$f":"IF(E176=0,\"\", 1.1564*E176 + 31.521)","v":""},{"$f":"IF(E176=0,\"\", 0.00002*E176^2 - 0.0342*E176 + 25.721)","v":""},0,0,1000,0,0,0,0,0,0,{"$f":"IF(E176=0,\"\",72.3+0.0249*O176-0.000128*S176)","v":""},{"$f":"IF(M176=0,\"\",65.3+0.0517*O176-0.000088*T176)","v":""},{"$f":"IF(W144=0,\"\",80.5+0.0133*O176-0.0051*P176-0.000135*S176)","v":""},"","dMO par CB","",{"$f":"IF($C$66=\"LUZ\",Z176,0)","v":0},"luz",{"$f":"IF(AND($A$84=2,$J$60<3),100*((-1016.7+($J$115*1.8)+(($J$109*$J$117/1000)*1.106)+(($M$109*$M$115/1000)*(-3.01))+(($M$110*$M$111/1000)*(-0.0013))+10.3)/$J$115),0)","v":0},"dMOmaïs PE équation ALP12","",{"$f":"IF($C$66=\"LUZ\",AE176,0)","v":0},"",{"$f":"IF($C$66=\"LUZ\",AG176,0)","v":0},"",{"$f":"IF($C$66=\"LUZ\",AI176,0)","v":0}]
[null,"ensilé","maïs",0,0,0,0,0,{"$f":"IF(E177=0,\"\",1.1218*E177 + 6.4254)","v":""},{"$f":"IF(E177=0,\"\", 1.4325*E177 + 157.81)","v":""},{"$f":"IF(E177=0,\"\", -0.0003*E177^2 +0.1992*E177 -14.604)","v":""},0,0,1000,0,0,0,0,0,0,{"$f":"IF(E177=0,\"\",79.4+0.0652*O177-0.0591*P177)","v":""},{"$f":"IF(M177=0,\"\",IF(L177=0,\"\",75.7+0.0701*O177+0.0156*L177/N177*1000-0.072*Q177))","v":""},{"$f":"IF(W144=0,\"\",97.6-0.1711*P177+0.00028*S177)","v":""},"","dMO par CB","",{"$f":"IF(Z177=\"\",\"\",IF($C$66=\"MAIS\",SUM(AC171:AC177),0))","v":""},"maïs",{"$f":"IF(AND($A$84=3,$J$60<3),100*((-1016.7+($J$115*1.8)+(($J$109*$J$117/1000)*1.106)+(($M$109*$M$115/1000)*(-3.01))+(($M$110*$M$111/1000)*(-0.0013))-10.3)/$J$115),0)","v":0},"dMOmaïs pas PE équation ALP12","",{"$f":"IF($C$66=\"MAIS\",AE177,0)","v":0},"",{"$f":"IF($C$66=\"MAIS\",AG177,0)","v":0},"",{"$f":"IF($C$66=\"MAIS\",AI177,0)","v":0}]
[null,"séché","G",0,0,0,0,0,{"$f":"IF(E178=0,\"\", 0.9804*E178 + 36.115)","v":""},{"$f":"IF(E178=0,\"\", 1.577*E178 + 73.373)","v":""},{"$f":"IF(E178=0,\"\", -0.0006*E178^2 + 0.2497*E178 + 60.394)","v":""},0,0,1000,0,0,0,0,0,0,{"$f":"IF(E178=0,\"\",28.5+0.1769*O178+0.173*P178-0.000313*R178-0.000351*S178)","v":""},{"$f":"IF(M178=0,\"\",20.4+0.1769*O178+0.209*Q178-0.000312*R178-0.000371*T178)","v":""},{"$f":"IF(V144=0,\"\",116.1-0.000075*R178-0.1976*P178+0.000132*S178)","v":""},"","dMO par CB",{"$f":"IF($C$60=\"SEC\",X178,\"\")","v":""},{"$f":"IF($C$66=\"G\",Z178,0)","v":""},"G",null,null,{"$f":"IF($C$60=\"SEC\",I178,\"\")","v":""},{"$f":"IF($C$66=\"G\",AE178,0)","v":""},{"$f":"IF($C$60=\"SEC\",J178,\"\")","v":""},{"$f":"IF($C$66=\"G\",AG178,0)","v":""},{"$f":"IF($C$60=\"SEC\",K178,\"\")","v":""},{"$f":"IF($C$66=\"G\",AI178,0)","v":""}]
[null,"séché","GR",0,0,0,0,0,{"$f":"IF(E179=0,\"\", 1.0684*E179 + 12.246)","v":""},{"$f":"IF(E179=0,\"\", 1.9027*E179 - 15.55)","v":""},{"$f":"IF(E179=0,\"\", 0.0023*E179^2 - 1.3048*E179 + 306.95)","v":""},0,0,1000,0,0,0,0,0,0,{"$f":"IF(E179=0,\"\",14.8+0.1292*O179+0.3494*P179-0.000226*R179-0.000713*S179)","v":""},{"$f":"IF(M179=0,\"\",6.6+0.1292*O179+0.3694*Q179-0.000226*R179-0.00067*T179)","v":""},{"$f":"IF(V144=0,\"\",75+0.0117*O179+0.0288*P179-0.000175*S179)","v":""},"","dMO par CB",{"$f":"IF($C$60=\"SEC\",X179,\"\")","v":""},{"$f":"IF($C$66=\"GR\",Z179,0)","v":0},"GR",null,null,"",{"$f":"IF($C$66=\"GR\",AE179,0)","v":0},"",{"$f":"IF($C$66=\"GR\",AG179,0)","v":0},"",{"$f":"IF($C$66=\"GR\",AI179,0)","v":0}]
[null,"séché","E ",0,0,0,0,0,{"$f":"IF(E180=0,\"\", 0.9673*E180 + 43.126)","v":""},{"$f":"IF(E180=0,\"\", 1.6443*E180 + 38.422)","v":""},{"$f":"IF(E180=0,\"\", -0.0004*E180^2 + 0.1396*E180 + 78.539)","v":""},0,0,1000,0,0,0,0,0,0,{"$f":"IF(E180=0,\"\",35.1+0.171*O180+0.1408*P180-0.000302*R180-0.000315*S180)","v":""},{"$f":"IF(M180=0,\"\",26.9+0.1711*O180+0.1809*Q180-0.000302*R180-0.000343*T180)","v":""},{"$f":"IF(V144=0,\"\",110.7-0.0476*O180-0.121*P180)","v":""},"","dMO par CB","",{"$f":"IF($C$66=\"E\",Z180,0)","v":0},"E ",null,null,"",{"$f":"IF($C$66=\"E\",AE180,0)","v":0},"",{"$f":"IF($C$66=\"E\",AG180,0)","v":0},"",{"$f":"IF($C$66=\"E\",AI180,0)","v":0}]
[null,"séché","ER ",0,0,0,0,0,{"$f":"IF(E181=0,\"\", 1.0747*E181 + 16.812)","v":""},{"$f":"IF(E181=0,\"\", 1.9253*E181 - 31.412)","v":""},{"$f":"IF(E181=0,\"\", 0.0007*E181^2 - 0.3657*E181 + 166.76)","v":""},0,0,1000,0,0,0,0,0,0,{"$f":"IF(E181=0,\"\",35.8+0.092*O181+0.2539*P181-0.000162*R181-0.000609*S181)","v":""},{"$f":"IF(M181=0,\"\",27.3+0.0924*O181+0.2846*Q181-0.000162*R181-0.000581*T181)","v":""},{"$f":"IF(V144=0,\"\",91.6-0.0072*O181-0.0513*P181-0.000055*S181)","v":""},"","dMO par CB","",{"$f":"IF($C$66=\"ER\",Z181,0)","v":0},"ER ",null,null,"",{"$f":"IF($C$66=\"ER\",AE181,0)","v":0},"",{"$f":"IF($C$66=\"ER\",AG181,0)","v":0},"",{"$f":"IF($C$66=\"ER\",AI181,0)","v":0}]
[null,"séché","L ",0,0,0,0,0,{"$f":"IF(E182=0,\"\", 1.0964*E182 + 20.95)","v":""},{"$f":"IF(E182=0,\"\", 1.547*E182 + 27.134)","v":""},{"$f":"IF(E182=0,\"\", 0.001*E182^2 -0.4922*E182 + 153.24)","v":""},0,0,1000,0,0,0,0,0,0,{"$f":"IF(E182=0,\"\",80.4-0.000189*S182)","v":""},{"$f":"IF(M182=0,\"\",81.6-0.000149*T182)","v":""},{"$f":"IF(V144=0,\"\",118.8-0.000229*R182-0.1546*P182)","v":""},"","dMO par CB","",{"$f":"IF($C$66=\"L\",Z182,0)","v":0},"L ",null,null,"",{"$f":"IF($C$66=\"L\",AE182,0)","v":0},"",{"$f":"IF($C$66=\"L\",AG182,0)","v":0},"",{"$f":"IF($C$66=\"L\",AI182,0)","v":0}]
[null,"séché","DF ",0,0,0,0,0,{"$f":"IF(E183=0,\"\", 0.9484*E183 + 54.064)","v":""},{"$f":"IF(E183=0,\"\", 1.8063*E183 - 23.954)","v":""},{"$f":"IF(E183=0,\"\", 0.0004*E183^2 - 0.266*E183 + 140.2)","v":""},0,0,1000,0,0,0,0,0,0,{"$f":"IF(E183=0,\"\",52.2+0.0845*O183+0.1341*P183-0.000147*R183-0.000385*S183)","v":""},{"$f":"IF(M183=0,\"\",41.7+0.0829*O183+0.1981*Q183-0.000143*R183-0.000439*T183)","v":""},{"$f":"IF(V144=0,\"\",133.5-0.0638*O183-0.3265*P183+0.000369*S183)","v":""},"","dMO par CB","",{"$f":"IF($C$66=\"DF\",Z183,0)","v":0},"DF ",null,null,"",{"$f":"IF($C$66=\"DF\",AE183,0)","v":0},"",{"$f":"IF($C$66=\"DF\",AG183,0)","v":0},"",{"$f":"IF($C$66=\"DF\",AI183,0)","v":0}]
[null,"séché","DT ",0,0,0,0,0,{"$f":"IF(E184=0,\"\", 1.2405*E184 + 1.1376)","v":""},{"$f":"IF(E184=0,\"\", 1.8784*E184 - 37.912)","v":""},{"$f":"IF(E184=0,\"\", 0.0004*E184^2 - 0.2928*E184 + 153.75)","v":""},0,0,1000,0,0,0,0,0,0,{"$f":"IF(E184=0,\"\",37.6+0.194*O184+0.1411*P184-0.000363*R184-0.000425*S184)","v":""},{"$f":"IF(M184=0,\"\",29.9+0.1947*O184+0.1464*Q184-0.000365*R184-0.000278*T184)","v":""},{"$f":"IF(V144=0,\"\",133.5-0.0638*O184-0.3265*P184+0.000369*S184)","v":""},"","dMO par CB","",{"$f":"IF($C$66=\"DT\",Z184,0)","v":0},"DT ",null,null,"",{"$f":"IF($C$66=\"DT\",AE184,0)","v":0},"",{"$f":"IF($C$66=\"DT\",AG184,0)","v":0},"",{"$f":"IF($C$66=\"DT\",AI184,0)","v":0}]
[null,"séché","IND ",0,0,0,0,0,{"$f":"IF(E185=0,\"\", 1.0607*E185 + 25.317)","v":""},{"$f":"IF(E185=0,\"\", 1.5436*E193 + 68.821)","v":""},{"$f":"IF(E185=0,\"\", -0.003*E185^2 + 1.4813*E185 - 73.603)","v":""},0,0,1000,0,0,0,0,0,0,{"$f":"IF(E185=0,\"\",50.6+0.136*O185+0.0952*P185-0.000282*R185-0.00028*S185)","v":""},{"$f":"IF(M185=0,\"\",48.5+0.121*O185+0.1214*Q185-0.000254*R185-0.0003*T185)","v":""},{"$f":"IF(V144=0,\"\",70.6+0.0815*O185-0.000173*R185-0.000109*S185)","v":""},"","dMO par CB","",{"$f":"IF($C$66=\"INC\",Z185,0)","v":0},"IND ",null,null,"",{"$f":"IF($C$66=\"INC\",AE185,0)","v":0},"",{"$f":"IF($C$66=\"INC\",AG185,0)","v":0},"",{"$f":"IF($C$66=\"INC\",AI185,0)","v":0}]
[null,"séché","dg",0,0,0,0,0,{"$f":"IF(E186=0,\"\", 0.9741*E186 + 31.782)","v":""},{"$f":"IF(E186=0,\"\", 1.358*E186 + 156)","v":""},{"$f":"IF(E186=0,\"\", 0.0011*E186^2 -0.6995*E186 +195.45)","v":""},0,0,1000,0,0,0,0,0,0,{"$f":"IF(E186=0,\"\",87.6-0.000187*S186)","v":""},{"$f":"IF(M186=0,\"\",90.1-0.00018*T186)","v":""},null,"","dMO par CB","",{"$f":"IF($C$66=\"dg\",Z186,0)","v":0},"dg",null,null,"",{"$f":"IF($C$66=\"dg\",AE186,0)","v":0},"",{"$f":"IF($C$66=\"dg\",AG186,0)","v":0},"",{"$f":"IF($C$66=\"dg\",AI186,0)","v":0}]
[null,"séché","lp",0,0,0,0,0,{"$f":"IF(E187=0,\"\", 1.1871*E187 - 25.321)","v":""},{"$f":"IF(E187=0,\"\", 2.0965*E187 - 52.379)","v":""},{"$f":"IF(E187=0,\"\", 0.0109*E187^2 - 6.0701*E187 + 988.42)","v":""},0,0,1000,0,0,0,0,0,0,{"$f":"IF(E187=0,\"\",93.5-0.000291*S187)","v":""},{"$f":"IF(M187=0,\"\",92.3-0.000236*T187)","v":""},{"$f":"IF(W144=0,\"\",131.1-0.0159*O187-0.3102*P187+0.000369*S187)","v":""},"","dMO par CB","",{"$f":"IF($C$66=\"lp\",Z187,0)","v":0},"lp",null,null,"",{"$f":"IF($C$66=\"lp\",AE187,0)","v":0},"",{"$f":"IF($C$66=\"lp\",AG187,0)","v":0},"",{"$f":"IF($C$66=\"lp\",AI187,0)","v":0}]
[null,"séché","li",0,0,0,0,0,{"$f":"IF(E188=0,\"\", 1.2035*E188 - 20.333)","v":""},{"$f":"IF(E188=0,\"\", 1.7517*E188 + 34.706)","v":""},{"$f":"IF(E188=0,\"\", -0.0004*E188^2 + 0.1567*E188 + 154.25)","v":""},0,0,1000,0,0,0,0,0,0,{"$f":"IF(E188=0,\"\",95.5-0.00037*S188)","v":""},{"$f":"IF(M188=0,\"\",93.9-0.000277*T188)","v":""},{"$f":"IF(W144=0,\"\",131.1-0.0159*O188-0.3102*P188+0.000369*S188)","v":""},"","dMO par CB","",{"$f":"IF($C$66=\"li\",Z188,0)","v":0},"li",null,null,"",{"$f":"IF($C$66=\"li\",AE188,0)","v":0},"",{"$f":"IF($C$66=\"li\",AG188,0)","v":0},"",{"$f":"IF($C$66=\"li\",AI188,0)","v":0}]
[null,"séché","ap",0,0,0,0,0,{"$f":"IF(E189=0,\"\", 1.2149*E189 - 32.263)","v":""},{"$f":"IF(E189=0,\"\", 2.1722*E189 - 76.853)","v":""},{"$f":"IF(E189=0,\"\", 0.0032*E189^2 - 2.2697*E189 + 456.68)","v":""},0,0,1000,0,0,0,0,0,0,{"$f":"IF(E189=0,\"\",98-0.000322*S189)","v":""},{"$f":"IF(M189=0,\"\",95.8-0.000249*T189)","v":""},null,"","dMO par CB","",{"$f":"IF($C$66=\"ap\",Z189,0)","v":0},"ap",null,null,"",{"$f":"IF($C$66=\"ap\",AE189,0)","v":0},"",{"$f":"IF($C$66=\"ap\",AG189,0)","v":0},"",{"$f":"IF($C$66=\"ap\",AI189,0)","v":0}]
[null,"séché","tr",0,0,0,0,0,{"$f":"IF(E190=0,\"\", 1.2727*E190 + 3.5455)","v":""},{"$f":"IF(E190=0,\"\", 1.5621*E190 - 13.457)","v":""},{"$f":"IF(E190=0,\"\", -0.0069*E190^2 + 2.517*E190 - 160.32)","v":""},0,0,1000,0,0,0,0,0,0,{"$f":"IF(E190=0,\"\",81-0.000216*S190)","v":""},{"$f":"IF(M190=0,\"\",80.9-0.000129*T190)","v":""},null,"","dMO par CB","",{"$f":"IF($C$66=\"tr\",Z190,0)","v":0},"tr",null,null,"",{"$f":"IF($C$66=\"tr\",AE190,0)","v":0},"",{"$f":"IF($C$66=\"tr\",AG190,0)","v":0},"",{"$f":"IF($C$66=\"tr\",AI190,0)","v":0}]
[null,"séché","tp",0,0,0,0,0,{"$f":"IF(E191=0,\"\", 1.125*E191 + 17.991)","v":""},{"$f":"IF(E191=0,\"\", 1.3119*E191 + 52.525)","v":""},{"$f":"IF(E191=0,\"\", -0.002*E191^2 -0.0002*E191 +89.572)","v":""},0,0,1000,0,0,0,0,0,0,{"$f":"IF(E191=0,\"\",77.6-0.000156*S191)","v":""},{"$f":"IF(M191=0,\"\",78.3-0.000116*T191)","v":""},null,"","dMO par CB","",{"$f":"IF($C$66=\"tp\",Z191,0)","v":0},"tp",null,null,"",{"$f":"IF($C$66=\"tp\",AE191,0)","v":0},"",{"$f":"IF($C$66=\"tp\",AG191,0)","v":0},"",{"$f":"IF($C$66=\"tp\",AI191,0)","v":0}]
[null,"séché","luz",0,0,0,0,0,{"$f":"IF(E192=0,\"\", 1.057*E192 + 32.991)","v":""},{"$f":"IF(E192=0,\"\", 1.2979*E192 + 27.166)","v":""},{"$f":" IF(E192=0,\"\",0.0001*E192^2 - 0.1174*E192 + 68.617)","v":""},0,0,1000,0,0,0,0,0,0,{"$f":"IF(E192=0,\"\",76.8-0.000131*S192)","v":""},{"$f":"IF(M192=0,\"\",78.1-0.000107*T192)","v":""},{"$f":"IF(W144=0,\"\",96.8-0.0218*O192-0.0655*P192-0.000057*S192)","v":""},"","dMO par CB","",{"$f":"IF($C$66=\"LUZ\",Z192,0)","v":0},"luz",null,null,"",{"$f":"IF($C$66=\"LUZ\",AE192,0)","v":0},"",{"$f":"IF($C$66=\"LUZ\",AG192,0)","v":0},"",{"$f":"IF($C$66=\"LUZ\",AI192,0)","v":0}]
[null,"séché","maïs",0,0,0,0,0,{"$f":"IF(E193=0,\"\",\"pas d'équation\")","v":""},{"$f":"IF(E193=0,\"\",\"pas d'équation\")","v":""},{"$f":"IF(E193=0,\"\",\"pas d'équation\")","v":""},0,0,null,null,null,null,null,null,null,null,null,null,0,"dMO par CB",{"$f":"IF($C$60=\"SEC\",X193,\"\")","v":""},{"$f":"IF($C$66=\"MAIS\",Z193,0)","v":0},"maïs",null,null,"",{"$f":"IF($C$66=\"MAIS\",AE193,0)","v":0},"",{"$f":"IF($C$66=\"MAIS\",AG193,0)","v":0},"",{"$f":"IF($C$66=\"MAIS\",AI193,0)","v":0}]
[null,"dzu","G",0,0,0,0,0,{"$f":"IF(E194=0,\"\", 1.0106*E194 + 40.486)","v":""},{"$f":"IF(E194=0,\"\", 1.7104*E194 + 59.376)","v":""},{"$f":"IF(E194=0,\"\", -0.0011*E194^2 + 0.5214*E194 +31.798)","v":""},0,0,1000,{"$f":"D194/N194*1000","v":0},{"$f":"E194/N194*1000","v":0},0,0,0,0,{"$f":"IF(E194=0,\"\",65.3+0.0869*O194+0.0692*P194-0.000175*R194-0.000299*S194)","v":""},{"$f":"IF(F194=0,\"\",57.4+0.1132*O194+0.1171*Q194-0.000271*R194-0.000336*T194)","v":""},{"$f":"IF(V144=0,\"\",82.5-0.000145*S194)","v":""},"","dMO par CB",{"$f":"IF($C$60=\"DZU\",X194,\"\")","v":""},{"$f":"IF($C$66=\"G\",Z194,0)","v":""},"G",null,null,{"$f":"IF($C$60=\"DZU\",I194,\"\")","v":""},{"$f":"IF($C$66=\"G\",AE194,0)","v":""},{"$f":"IF($C$60=\"DZU\",J194,\"\")","v":""},{"$f":"IF($C$66=\"G\",AG194,0)","v":""},{"$f":"IF($C$60=\"DZU\",K194,\"\")","v":""},{"$f":"IF($C$66=\"G\",AI194,0)","v":""}]
[null,"dzu","GR",0,0,0,0,0,{"$f":" IF(E195=0,\"\",1.0697*E195 + 25.013)","v":""},{"$f":"IF(E195=0,\"\", 1.889*E195 + 11.584)","v":""},{"$f":"IF(E195=0,\"\", 0.0023*E195^2 - 1.2472*E195 + 298.7)","v":""},0,0,1000,0,0,0,0,0,0,{"$f":"IF(E195=0,\"\",63.8+0.1905*P195-0.000602*S195)","v":""},{"$f":"IF(F195=0,\"\",41.4+0.3186*Q195-0.000707*T195)","v":""},{"$f":"IF(V144=0,\"\",82.7-0.000124*S195)","v":""},"","dMO par CB",{"$f":"IF($C$60=\"DZU\",X195,\"\")","v":""},{"$f":"IF($C$66=\"GR\",Z195,0)","v":0},"GR",null,null,{"$f":"IF($C$60=\"DZU\",I195,\"\")","v":""},{"$f":"IF($C$66=\"GR\",AE195,0)","v":0},"",{"$f":"IF($C$66=\"GR\",AG195,0)","v":0},"",{"$f":"IF($C$66=\"GR\",AI195,0)","v":0}]
[null,"dzu","E ",0,0,0,0,0,{"$f":"IF(E196=0,\"\", 1.0213*E196 + 42.825)","v":""},{"$f":"IF(E196=0,\"\", 1.7604*E196 + 32.268)","v":""},{"$f":"IF(E196=0,\"\", -0.0008*E196^2 + 0.3532*E196 +57.161)","v":""},0,0,1000,0,0,0,0,0,0,{"$f":"IF(E196=0,\"\",80.8+0.0383*P196-0.000285*S196)","v":""},{"$f":"IF(F196=0,\"\",66.4+0.1432*Q196-0.000404*T196)","v":""},{"$f":"IF(V144=0,\"\",84.1-0.00003*R196-0.000145*S196)","v":""},"","dMO par CB","",{"$f":"IF($C$66=\"E\",Z196,0)","v":0},"E ",null,null,"",{"$f":"IF($C$66=\"E\",AE196,0)","v":0},"",{"$f":"IF($C$66=\"E\",AG196,0)","v":0},"",{"$f":"IF($C$66=\"E\",AI196,0)","v":0}]
[null,"dzu","ER ",0,0,0,0,0,{"$f":"IF(E197=0,\"\", 1.022*E197 + 42.236)","v":""},{"$f":"IF(E197=0,\"\", 1.8612*E197 + 7.4654)","v":""},{"$f":"IF(E197=0,\"\", 0.0011*E197^2 - 0.5642*E197 + 193.99)","v":""},0,0,1000,0,0,0,0,0,0,{"$f":"IF(E197=0,\"\",63.2+0.1888*P197-0.00061*S197)","v":""},{"$f":"IF(F197=0,\"\",42.7+0.309*Q197-0.000697*T197)","v":""},{"$f":"IF(V144=0,\"\",84.4-0.0029*O197-0.000124*S197)","v":""},"","dMO par CB","",{"$f":"IF($C$66=\"ER\",Z197,0)","v":0},"ER ",null,null,"",{"$f":"IF($C$66=\"ER\",AE197,0)","v":0},"",{"$f":"IF($C$66=\"ER\",AG197,0)","v":0},"",{"$f":"IF($C$66=\"ER\",AI197,0)","v":0}]
[null,"dzu","L ",0,0,0,0,0,{"$f":"IF(E198=0,\"\", 1.0657*E198 + 41.069)","v":""},{"$f":"IF(E198=0,\"\", 1.5277*E198 + 51.073)","v":""},{"$f":"IF(E198=0,\"\", 0.0007*E198^2 -0.3378*E198 + 140.87)","v":""},0,0,1000,0,0,0,0,0,0,{"$f":"IF(E198=0,\"\",74.8+0.0693*P198-0.000363*S198)","v":""},{"$f":"IF(F198=0,\"\",68.3+0.1159*Q198-0.00036*T198)","v":""},{"$f":"IF(V144=0,\"\",91.5-0.0336*O198-0.00018*S198)","v":""},"","dMO par CB","",{"$f":"IF($C$66=\"L\",Z198,0)","v":0},"L ",null,null,"",{"$f":"IF($C$66=\"L\",AE198,0)","v":0},"",{"$f":"IF($C$66=\"L\",AG198,0)","v":0},"",{"$f":"IF($C$66=\"L\",AI198,0)","v":0}]
[null,"dzu","DF ",0,0,0,0,0,{"$f":"IF(E199=0,\"\", 1.1106*E199 + 38.491)","v":""},{"$f":"IF(E199=0,\"\", 1.9114*E199 - 18.378)","v":""},{"$f":"IF(E199=0,\"\", 0.0031*E199^2 - 1.2797*E199 + 238.44)","v":""},0,0,1000,0,0,0,0,0,0,{"$f":"IF(E199=0,\"\",70.2+0.1057*P199-0.000414*S199)","v":""},{"$f":"IF(F199=0,\"\",50.21+0.2478*Q199-0.000582*T199)","v":""},{"$f":"IF(V144=0,\"\",82-0.000232*S199)","v":""},"","dMO par CB","",{"$f":"IF($C$66=\"DF\",Z199,0)","v":0},"DF ",null,null,"",{"$f":"IF($C$66=\"DF\",AE199,0)","v":0},"",{"$f":"IF($C$66=\"DF\",AG199,0)","v":0},"",{"$f":"IF($C$66=\"DF\",AI199,0)","v":0}]
[null,"dzu","DT ",0,0,0,0,0,{"$f":"IF(E200=0,\"\", 1.1808*E200 + 28.253)","v":""},{"$f":"IF(E200=0,\"\", 1.9087*E200 - 18.369)","v":""},{"$f":"IF(E200=0,\"\", 0.0013*E200^2 - 0.6398*E200 + 190.2)","v":""},0,0,1000,0,0,0,0,0,0,{"$f":"IF(E200=0,\"\",56.6+0.1229*O200+0.1021*P200-0.000237*R200-0.000459*S200)","v":""},{"$f":"IF(F200=0,\"\",48.4+0.2396*O200+0.0452*Q200-0.000507*R200-0.0002*T200)","v":""},{"$f":"IF(V144=0,\"\",82-0.000323*S200)","v":""},"","dMO par CB","",{"$f":"IF($C$66=\"DT\",Z200,0)","v":0},"DT ",null,null,"",{"$f":"IF($C$66=\"DT\",AE200,0)","v":0},"",{"$f":"IF($C$66=\"DT\",AG200,0)","v":0},"",{"$f":"IF($C$66=\"DT\",AI200,0)","v":0}]
[null,"dzu","IND ",0,0,0,0,0,{"$f":"IF(E201=0,\"\", 0.912*E201 + 69.778)","v":""},{"$f":"IF(E201=0,\"\", 1.9765*E201 - 28.485)","v":""},{"$f":"IF(E201=0,\"\", -0.0061*E201^2 + 2.7316*E201 - 190.18)","v":""},0,0,1000,0,0,0,0,0,0,{"$f":"IF(E201=0,\"\",48.6+0.1603*O201+0.071*P201-0.000344*R201-0.00025*S201)","v":""},{"$f":"IF(F201=0,\"\",42.8+0.145*O201+0.1241*Q201-0.00032*R201-0.000305*T201)","v":""},{"$f":"IF(V144=0,\"\",76.6+0.0165*O201-0.000097*S201)","v":""},"","dMO par CB","",{"$f":"IF($C$66=\"INC\",Z201,0)","v":0},"IND ",null,null,"",{"$f":"IF($C$66=\"INC\",AE201,0)","v":0},"",{"$f":"IF($C$66=\"INC\",AG201,0)","v":0},"",{"$f":"IF($C$66=\"INC\",AI201,0)","v":0}]
[null,"dzu","dg",0,0,0,0,0,{"$f":"IF(E202=0,\"\", 0.9485*E202 + 50.603)","v":""},{"$f":"IF(E202=0,\"\", 1.3544*E202 + 173.43)","v":""},{"$f":"IF(E202=0,\"\", 0.0003*E202^2 -0.2328*E202+130.78)","v":""},0,0,1000,0,0,0,0,0,0,{"$f":"IF(E202=0,\"\",0)","v":""},"",{"$f":"IF(V144=0,\"\",0)","v":""},"","dMO par CB","",{"$f":"IF($C$66=\"dg\",Z202,0)","v":0},"dg",null,null,"",{"$f":"IF($C$66=\"dg\",AE202,0)","v":0},"",{"$f":"IF($C$66=\"dg\",AG202,0)","v":0},"",{"$f":"IF($C$66=\"dg\",AI202,0)","v":0}]
[null,"dzu","lp",0,0,0,0,0,{"$f":"IF(E203=0,\"\", 1.1394*E203 + 0.7383)","v":""},{"$f":"IF(E203=0,\"\", 2.0725*E203 - 20.701)","v":""},{"$f":"IF(E203=0,\"\", 0.012*E203^2 - 6.3581*E203 + 991.84)","v":""},0,0,1000,0,0,0,0,0,0,"","",null,"","dMO par CB","",{"$f":"IF($C$66=\"lp\",Z203,0)","v":0},"lp",{"$f":"IF($J$60=3,W209,0)","v":0},"dMOmaïs LV99","",{"$f":"IF($C$66=\"lp\",AE203,0)","v":0},"",{"$f":"IF($C$66=\"lp\",AG203,0)","v":0},"",{"$f":"IF($C$66=\"lp\",AI203,0)","v":0}]
[null,"dzu","li",0,0,0,0,0,{"$f":"IF(E204=0,\"\", 1.1721*E204 + 2.3354)","v":""},{"$f":"IF(E204=0,\"\", 1.722*E204 + 63.087)","v":""},{"$f":"IF(E204=0,\"\", -0.0009*E204^2 + 0.3681*E204 + 141.55)","v":""},0,0,1000,0,0,0,0,0,0,"","",null,"","dMO par CB","",{"$f":"IF($C$66=\"li\",Z204,0)","v":0},"li",{"$f":"IF(AND($A$84=4,$J$60=1),U208,0)","v":0},"dMOmaïs LV06 par CB (INRA)","",{"$f":"IF($C$66=\"li\",AE204,0)","v":0},"",{"$f":"IF($C$66=\"li\",AG204,0)","v":0},"",{"$f":"IF($C$66=\"li\",AI204,0)","v":0}]
[null,"dzu","ap",0,0,0,0,0,{"$f":"IF(E205=0,\"\", 1.1677*E205 - 4.0533)","v":""},{"$f":" IF(E205=0,\"\",2.1029*E205 - 30.814)","v":""},{"$f":"IF(E205=0,\"\", 0.004*E205^2 - 2.6453*E205 + 498.69)","v":""},0,0,1000,0,0,0,0,0,0,{"$f":"IF(E205=0,\"\",0)","v":""},"",null,"","dMO par CB","",{"$f":"IF($C$66=\"ap\",Z205,0)","v":0},"ap",{"$f":"IF(AND($A$84=4,$J$60=2),U208,0)","v":0},"dMO maïs LV06 par ADFNDF (INRA)","",{"$f":"IF($C$66=\"ap\",AE205,0)","v":0},"",{"$f":"IF($C$66=\"ap\",AG205,0)","v":0},"",{"$f":"IF($C$66=\"ap\",AI205,0)","v":0}]
[null,"dzu","tr",0,0,0,0,0,{"$f":"IF(E206=0,\"\", 1.2857*E206 + 18.429)","v":""},{"$f":"IF(E206=0,\"\", 1.5594*E206 + 8.3748)","v":""},{"$f":"IF(E206=0,\"\", -0.0063*E206^2 + 2.1074*E206 - 104.16)","v":""},0,0,1000,0,0,0,0,0,0,{"$f":"IF(E206=0,\"\",0)","v":""},"",null,"","dMO par CB","",{"$f":"IF($C$66=\"tr\",Z206,0)","v":0},"tr",{"$f":"IF(AND($A$84=1,$J$60=1),100*((((N209*U209/100)*1.2812)-180.35)/N209),0)","v":{"$error":"#VALUE!"}},"dMOmaïscorr. Par MOD dMOCB: 1.2812 x MOD CB -180.35","",{"$f":"IF($C$66=\"tr\",AE206,0)","v":0},"",{"$f":"IF($C$66=\"tr\",AG206,0)","v":0},"",{"$f":"IF($C$66=\"tr\",AI206,0)","v":0}]
[null,"dzu","tp",0,0,0,0,0,{"$f":"IF(E207=0,\"\", 1.1148*E207 + 35.265)","v":""},{"$f":"IF(E207=0,\"\", 1.2903*E207 + 74.94)","v":""},{"$f":"IF(E207=0,\"\", 0.0001*E207^2 -0.0619*E207 +95.389)","v":""},0,0,1000,0,0,0,0,0,0,{"$f":"IF(E207=0,\"\",0)","v":""},"",null,"","dMO par CB","",{"$f":"IF($C$66=\"tp\",Z207,0)","v":0},"tp",{"$f":"IF(AND($A$84=1,$J$60=2),100*((((N209*V209/100)*1.2653)-156.12)/N209),0)","v":0},"dMOmaïs corr. Par MOD dMOADF : 1.2653 x MOD ADF - 156.12","",{"$f":"IF($C$66=\"tp\",AE207,0)","v":0},"",{"$f":"IF($C$66=\"tp\",AG207,0)","v":0},"",{"$f":"IF($C$66=\"tp\",AI207,0)","v":0}]
[null,"dzu","luz",0,0,0,0,0,{"$f":"IF(E208=0,\"\", 1.0342*E208 + 51.855)","v":""},{"$f":"IF(E208=0,\"\",1.2761*E208 + 49.236)","v":""},{"$f":"IF(E208=0,\"\", 0.00005*E208^2 - 0.0826*E208 + 66.837)","v":""},0,0,1000,0,0,0,0,0,0,{"$f":"IF(E208=0,\"\",78.7-0.000149*S208)","v":""},{"$f":"IF(M208=0,\"\",80.8-0.000118*T208)","v":""},{"$f":"IF(W144=0,\"\",115.3-0.0479*O208-0.1409*P208+0.000063*S208)","v":""},"","dMO par CB","",{"$f":"IF($C$66=\"LUZ\",Z208,0)","v":0},"luz",{"$f":"IF(AND($A$84=2,$J$60<3),100*((-1016.7+($J$115*1.8)+(($J$109*$J$117/1000)*1.106)+(($M$109*$M$115/1000)*(-3.01))+(($M$110*$M$111/1000)*(-0.0013))+10.3)/$J$115),0)","v":0},"dMOmaïs PE équation ALP12","",{"$f":"IF($C$66=\"LUZ\",AE208,0)","v":0},"",{"$f":"IF($C$66=\"LUZ\",AG208,0)","v":0},"",{"$f":"IF($C$66=\"LUZ\",AI208,0)","v":0}]
[null,"dzu","maïs",0,0,0,0,0,{"$f":"IF(E209=0,\"\", 1.1186*E209 + 8.0113)","v":""},{"$f":"IF(E209=0,\"\", 1.4381*E209 +155.24)","v":""},{"$f":"IF(E209=0,\"\", 0.0028*E209^2 + 1.2371*E209 -74.894)","v":""},0,0,1000,0,0,0,0,0,0,{"$f":"IF(E209=0,\"\",79.4+0.0652*O209-0.0591*P209)","v":""},{"$f":"IF(M209=0,\"\",IF(L209=0,\"\",75.7+0.0701*O209+0.0156*L209/N209*1000-0.072*Q209))","v":""},{"$f":"IF(W144=0,\"\",69.2+0.164*O209-0.000218*S209)","v":""},"","dMO par CB","",{"$f":"IF(Z209=\"\",\"\",IF($C$66=\"MAIS\",SUM(AC203:AC209),0))","v":""},"maïs",{"$f":"IF(AND($A$84=3,$J$60<3),100*((-1016.7+($J$115*1.8)+(($J$109*$J$117/1000)*1.106)+(($M$109*$M$115/1000)*(-3.01))+(($M$110*$M$111/1000)*(-0.0013))-10.3)/$J$115),0)","v":0},"dMOmaïs pas PE équation ALP12","",{"$f":"IF($C$66=\"MAIS\",AE209,0)","v":0},"",{"$f":"IF($C$66=\"MAIS\",AG209,0)","v":0},"",{"$f":"IF($C$66=\"MAIS\",AI209,0)","v":0}]
[null,null,null,null,null,null,null,null,"pas de régressions ou rég. LV99",null,null,null,null,null,null,null,null,null,null,null,"pas de regressions"]
[null,null,null,null,null,null,null,null,"reg ARY base dig-feva"]
[]
["Calcul de la valeur énergétique des fourrages"]
[]
["EB",{"$f":"IF(B66=16,B218,B217)","v":18.8}]
[]
["EB exc.maïs",{"$f":"0.0188*J115+0.0078*J109","v":18.8}]
["EB maïs",{"$f":"0.0196*(J108-J111)","v":19.599999999999998}]
[]
["EM",{"$f":"C220*G2/100","v":{"$error":"#VALUE!"}},{"$f":"IF(B66=16,C225,IF(C221<7,C222,C223))","v":{"$error":"#VALUE!"}},null,null,null,{"$f":"ISERROR(C220)","v":true}]
["MOD/MAD",null,{"$f":"(J115*G18/100)/(J109*G19/100)","v":{"$error":"#VALUE!"}}]
["EM MOD/MA<7",null,{"$f":"0.0142*J115*(G18/100)+0.0059*C227","v":{"$error":"#VALUE!"}}]
["EM MOD/MAD>=7",null,{"$f":"0.01507*J115*G18/100","v":{"$error":"#VALUE!"}}]
[]
["EM Maïs PE",null,{"$f":"0.0155*J115*G18/100","v":{"$error":"#VALUE!"}}]
[]
["MAD reg ou donné",null,{"$f":"IF(I227<>C228,J109*I227/100,C228)","v":{"$error":"#DIV/0!"}},">>>>>>>>>","dMA issue",{"$f":"C227/J109*100","v":{"$error":"#DIV/0!"}},{"$f":"ISERROR(F227)","v":true},null,{"$f":"IF(G14=\"\",C228/J109*100,G14)","v":{"$error":"#DIV/0!"}}]
["MAD reg retenue ",null,{"$f":"IF(B60=1,C229,IF(B60=2,C229,IF(B60=3,C230,IF(B60=4,C230,\"erreur\"))))","v":0}]
["MAD vert+ensilage",null,{"$f":"J109*(0.33+0.0033*M109-0.0000061*M113)","v":0}]
["MAD sec+dzu artificiel",null,{"$f":"J109*(0.29+0.0033*M109-0.0000064*M113)","v":0}]
[]
["q",{"$f":"C220/B215","v":{"$error":"#VALUE!"}}]
["kL",{"$f":"0.463+0.24*B232","v":{"$error":"#VALUE!"}}]
["kEN",{"$f":"0.554+0.287*B232","v":{"$error":"#VALUE!"}}]
["kV",{"$f":"0.006+0.78*B232","v":{"$error":"#VALUE!"}}]
["kENV",{"$f":"(1.5*B234*B235)/((0.5*B234)+B235)","v":{"$error":"#VALUE!"}}]
[]
["Energie nette"]
["NEL",null,{"$f":"(B233*C220*0.9752)*G2/100","v":{"$error":"#VALUE!"}},null,null,null,{"$f":"ISERROR(C239)","v":true}]
["NEV",null,{"$f":"(B236*C220)*G2/100","v":{"$error":"#VALUE!"}},null,null,null,{"$f":"ISERROR(C240)","v":true}]
[]
[]
[]
["Calcul de la valeur azotée des fourrages",null,null,null,null,null,null,null,null,{"$f":"SUM(J249,J252,J254)","v":65},"deMA Maïs LV06",null,"Maïs",null,null,null,"maturité maïs vert"]
[null,null,"LV99",null,null,null,"LV06",null,null,null,"Etat","Stade","deMA","MS",{"$f":"M9","v":35},null,3]
["deMA",{"$f":"G10","v":""},{"$f":"IF(B66=16,C252,IF(B60=1,C247,IF(B60=2,C248,IF(B60=3,C250,IF(B60=4,C250,\"erreur!\")))))","v":""},null,{"$f":"ISERROR(B246)","v":false},null,{"$f":"IF(B66=16,G252,IF(B60=1,G247,IF(B60=2,H246,IF(B60=3,G250,IF(B60=4,G251,\"erreur!\")))))","v":""},{"$f":"IF(M9<50,G248,G249)","v":""},null,null,"vert","Blüte",70,15,{"$f":"IF($O$245=0,0,IF($O$245>=15,IF($O$245<20,M246,0),0))","v":0},null,{"$f":"IF(Q245<=2,M247,M248)","v":65}]
[{"$f":"IF(F60=1,G246,C246)","v":""},"herbe",{"$f":"IF(M109=0,\"\",45.8+0.18*M109-0.00027*M113)","v":""},null,null,null,{"$f":"IF(M109=0,\"\",51.2+0.126*M109-0.00014*M113)","v":""},null,null,null,null,"Milchreife",70,20,{"$f":"IF($O$245=0,0,IF($O$245>=22,IF($O$245<26,M247,0),0))","v":0},"22 max"]
[null,"ensilag herbe",{"$f":"IF(M109=0,\"\",50.2+0.128*M109-0.00008*M113)","v":""},null,null,"<50%MS",{"$f":"IF(M109=0,\"\",59.5+0.153*M109-0.0002*M113)","v":""},null,null,null,null,"Beginn Teigreife",65,26,{"$f":"IF($O$245=0,0,IF($O$245>=26,IF($O$245<32,M248,0),0))","v":0}]
[null,null,null,null,null,">50%MS",{"$f":"IF(M109=0,\"\",54.5+0.153*M109-0.0002*M113)","v":""},null,null,{"$f":"IF(B60=1,IF(Q245<=2,M247,M248),0)","v":65},null,"Teigreife",65,32,{"$f":"IF($O$245=0,0,IF($O$245>=32,M249,0))","v":65},{"$f":"AVERAGE(M246:M249)","v":67.5},{"$f":"IF(B60=1,IF(O245<22,70,65),0)","v":65}]
[null,"four. sec+ dzu",{"$f":"IF(M109=0,\"\",42+0.175*M109-0.00026*M113)","v":""},null,null,null,{"$f":"IF(M109=0,\"\",48.9+0.144*M109-0.0002*M113)","v":""},null,null,null,"ensilé","Milchreife",72,22,{"$f":"IF($O$245=0,0,IF($O$245>=22,IF($O$245<26,M250,0),0))","v":0}]
[null,"DZU",null,null,null,null,{"$f":"IF(M109=0,\"\",51.9+0.092*M109-0.00015*M113)","v":""},null,null,null,null,"Beginn Teigreife",72,26,{"$f":"IF($O$245=0,0,IF($O$245>=26,IF($O$245<32,M251,0),0))","v":0}]
[null,"maïs PE",72,null,null,null,{"$f":"J244","v":65},null,null,{"$f":"IF(B60=2,72,0)","v":0},null,"Teigreife",72,32,{"$f":"IF($O$245=0,0,IF($O$245>=32,M252,0))","v":72},{"$f":"AVERAGE(M250:M252)","v":72}]
[null,null,null,null,null,null,null,null,null,null,"déshydraté","Beginn Teigreife",60,88]
["PF",{"$f":"IF(B60<>2,0,G9/F255)","v":0},{"$f":"IF(B60<>2,0,IF(M9>60,0,IF(B66=16,C256,C255)))","v":0},null,null,null,{"$f":"C254","v":0},null,null,{"$f":"IF(B60=4,60,0)","v":0},null,"Teigreife",60,88,{"$f":"IF(O245=0,0,P254)","v":60},{"$f":"AVERAGE(M253:M254)","v":60}]
[{"$f":"IF(J60<3,G254,C254)","v":0},"ens herb35MS",{"$f":"IF(OR(B60<>2,M9=\"\"),0,(205-(3*M9))/F255)","v":0},"p.rapport LV 99 divisé par ",null,{"$f":"IF(F60=1,2,1)","v":2}," /2"]
[null,"ens maïs30MS",{"$f":"IF(OR(B60<>2,M9=\"\"),0,(150-(2.5*M9))/F256)","v":0},"p.rapport LV 99 divisé par ",null,{"$f":"IF(F60=1,2,1)","v":2}," /2"]
[]
["dAAA",{"$f":"G11","v":""},{"$f":"IF(B66=16,C264,IF(B60=1,C259,IF(B60=2,C260,IF(B60=3,C262,IF(B60=4,C263,70)))))","v":""},null,{"$f":"ISERROR(B258)","v":false},null,{"$f":"IF(B66=16,G264,IF(B60=1,G259,IF(B60=2,H258,IF(B60=3,G262,IF(B60=4,G263,70)))))","v":""},{"$f":"IF(M9<50,G260,G261)","v":""}]
[{"$f":"IF(F60=1,G258,C258)","v":""},"herbe",{"$f":"IF(M109=0,\"\",66.1+0.104*M109-0.00006*M113)","v":""},null,null,null,{"$f":"IF(M109=0,\"\",65+0.132*M109-0.00014*M113)","v":""}]
[null,"ensilage h.",{"$f":"IF(M109=0,\"\",45.4+0.087*M109)","v":""},null,null,"<50%MS",{"$f":"IF(M109=0,\"\",62.8+0.138*M109-0.00016*M113)","v":""},null,null,null,null,"MS","amidon"]
[null,null,null,null,null,">50%MS",{"$f":"IF(M109=0,\"\",60.5+0.127*M109-0.00018*M113)","v":""},null,null,null,null,25,0]
[null,"fourr.secs",{"$f":"IF(M109=0,\"\",54.6+0.087*M109)","v":""},null,null,null,{"$f":"IF(M109=0,\"\",58.5+0.127*M109-0.00018*M113)","v":""}]
[null,"dzu",{"$f":"IF(M109=0,\"\",54.6+0.087*M109)","v":""},null,null,null,{"$f":"IF(M109=0,\"\",56.4+0.141*M109-0.00023*M113)","v":""}]
[null,"maïs PE",70,null,null,null,72]
[null,null,null,null,null,null,null,null,null,{"$f":"IF(F60=2,0,IF(O266<O267,0,IF(B66=16,SUM(J267:J269),0)))","v":0},"Maïs correction LV06  amidon à la MOF"]
["MOF",null,{"$f":"(J115*(G18/100))-(J109*(1-B246/100))-J114-B254-J265","v":{"$error":"#VALUE!"}},null,null,null,{"$f":"ISERROR(C266)","v":true},null,null,null,"Etat","amidon","deAMI","déductions",{"$f":"IF(B60=4,IF(M9=\"\",88,M9),M9)","v":35},"MS (88)  par défaut pour DZU si rien donné"]
["PAIE",null,{"$f":"((0.093*C266)+J109*(1.11*(1-B246/100))*(B258/100))*G2/100","v":{"$error":"#VALUE!"}},null,null,null,{"$f":"ISERROR(C267)","v":true},null,null,{"$f":"IF(B60=1,N267,0)","v":0},"vert",{"$f":"IF(G16=\"\",0,G16)","v":0},60,{"$f":"L267*(1-M267/100)","v":0},22,"MS limite pour tenir compte de la correction"]
["PAIN",null,{"$f":"(J109*(B246/100-0.1)*0.64+J109*(1.11*(1-B246/100))*B258/100)*G2/100","v":{"$error":"#VALUE!"}},null,null,null,true,null,null,{"$f":"IF(B60=2,N268,0)","v":0},"ensilé",{"$f":"IF(G16=\"\",0,G16)","v":0},70,{"$f":"L268*(1-M268/100)","v":0}]
["PAIMN",null,{"$f":"(J109*(B246/100-0.1)*0.64)*G2/100","v":{"$error":"#VALUE!"}},null,null,null,true,null,null,{"$f":"IF(B60=4,N269,0)","v":0},"déshydraté",{"$f":"IF(G16=\"\",0,G16)","v":0},50,{"$f":"L269*(1-M269/100)","v":0}]
["PMN",null,{"$f":"(J109*(1-(1.11*(1-B246/100))))*G2/100","v":{"$error":"#VALUE!"}},null,null,null,true]
["PME",null,{"$f":"(0.145*C266)*G2/100","v":{"$error":"#VALUE!"}},null,null,null,true]
["PAIA",null,{"$f":"(J109*(1.11*(1-B246/100))*B258/100)*G2/100","v":{"$error":"#VALUE!"}},null,null,null,true,null,null,{"$f":"IF(M9>=20,IF(M9<=30,22.571*M9-382.62,315),0)","v":315},"Teneur en amidon, source wyu"]
[null,null,null,null,null,null,null,null,null,null,"MS","Amidon"]
[null,null,null,null,null,null,null,null,null,null,14,0]
["PPL avec entretrien",null,"NEL","PAIE","PAIN",null,null,null,null,null,16,0,0]
["MSI",19,40.5,409,409,null,null,null,null,null,18,1]
["par kg MSI",null,{"$f":"C276/B276","v":2.1315789473684212},{"$f":"D276/B276","v":21.526315789473685},{"$f":"E276/B276","v":21.526315789473685},null,null,null,null,null,20,65]
["apport",null,{"$f":"C239","v":{"$error":"#VALUE!"}},{"$f":"C267","v":{"$error":"#VALUE!"}},{"$f":"C268","v":{"$error":"#VALUE!"}},null,null,null,null,null,22,115]
["solde production",null,{"$f":"C278-C277","v":{"$error":"#VALUE!"}},{"$f":"D278-D277","v":{"$error":"#VALUE!"}},{"$f":"E278-E277","v":{"$error":"#VALUE!"}},null,null,null,null,null,24,160,"y = 22.571x - 382.62"]
["PPL par kg MS avec entretrien",null,{"$f":"C279/3.14","v":{"$error":"#VALUE!"}},{"$f":"D279/50","v":{"$error":"#VALUE!"}},{"$f":"E279/50","v":{"$error":"#VALUE!"}},null,null,null,null,null,26,210,"R2 = 0.998"]
[null,null,null,null,null,null,null,null,null,null,28,250]
[{"$f":"CONCATENATE(\"PPL pour MSI \",B276,\"kg MS\")","v":"PPL pour MSI 19kg MS"},null,{"$f":"C280*19","v":{"$error":"#VALUE!"}},{"$f":"D280*B276","v":{"$error":"#VALUE!"}},{"$f":"E280*B276","v":{"$error":"#VALUE!"}},null,null,null,null,null,30,290]
[null,null,null,null,null,null,null,null,null,null,32,310]
[null,null,null,null,null,null,null,null,null,null,34,328]
[null,null,null,null,null,null,null,null,null,null,36,335,315]
[null,null,null,null,null,null,null,null,null,null,38,345]
[null,null,null,null,null,null,null,null,null,null,40,355]
[]
[]
[]
[]
[]
[]
[]
[]
[]
[null,"J","K","L"]
[true,"pas d'équation"]