{"text_format":"1","workbook":"xlsx","n_sheets":8,"sheets":["Mode d'emploi","Einführung","Aliments Futtermittel","aliments","Futtermittel","FORMULE","EXPORT","Trad. Uebersetz."],"not_rendered":{"charts":0,"images":10,"macros":1,"external_links":0,"defined_names":4,"comments":1,"pivot_tables":0},"unopened":[],"bounds":{"document_bytes":16777216,"sheet_cells":100000,"rows_first":2000,"rows_last":500,"rows_between":2000,"halvings":0,"cell_chars":16384,"cell_head_chars":4096},"cells_cut":0,"cells_raw":0,"read":"whole","date_system":"1900"}

{"sheet":"Mode d'emploi","index":0,"n_rows":110,"n_cols":14,"rows_kept":110,"cut":false,"hidden":false,"merged":[[109,3,109,5]]}
["Mode d'emploi",null,null,"Le fichier contient des macros, dès lors l'option macros doit être activée avant l'utilisation (voir ci-dessous).",null,null,null,null,null,null,null,null,null,"Agroscope , ARYV, 2014"]
[]
["Ce fichier-programme se base sur les équations éditées dans le Livre Vert, il permet de calculer les valeurs nutritives des aliments simples à partir des compositions chimiques analysées."]
["Il reprend les coefficients de digestibilité, dégradabilité et autres facteurs à partir des aliments de références issus du Livre Vert que vous choisissez dans le menu déroulant qui apprait losrqu'on clique dans la cellule des aliments de référence"]
["Si les teneurs en nutriments analysées s'éloignent trop des valeurs de l'aliment de référence, les valeurs nutritives calculées risquent d'être erronées par l'utilisation de coefficients ne correspondant plus."]
["Le programme est traduit en allemand resp. en français, cependant une fois le choix de l'aliment de référence fait le changement de langue engendrera des erreurs, dès lors il faut choisir l'aliment de référence dans la langue utilisée."]
[]
["Les définitions des nutriments sont disponibles en plaçant le pointeur sur le triangle rouge (commentaire) à droite de l'abréviation"]
["Les définitions des valeurs nutritives sont données et peuvent être masquées si nécessaires"]
[]
["Le programme offre la possibilité de rassembler les valeurs données et calculées dans une feuille d'exportation et de composer un mélange à partir de celles-ci."]
[]
[]
[]
["Feuille de travail: Aliments Futermittel",null,null,null,null,"cellule aliment de référence, "]
[null,null,null,null,null,"cliquez dans la cellule pour accéder au menu déroulant",null,null,null,null,"bouton définitions des valeurs nutritives pour les masquer/afficher"]
[]
[]
[null,"cellule libre pour texte     >"]
[]
[]
[]
[]
[]
[]
[]
[]
[]
[]
[]
[]
[]
[]
[]
[]
["valeurs du Livre Vert de l'aliment de"]
["référence                                           >"]
[]
["bouton choix des langues                   >"]
[]
["bouton EXPORT pour rassembler"]
["les données et composer un mélange"]
[]
["bouton RESTORE pour initialiser la page"]
[]
[]
[]
[]
[null,null,null,"MA",116,"g/kg MS"]
[null,null,null,"MG",16,"g/kg MS"]
[null,null,null,"CB",51,"g/kg MS","Les cellules avec l'écriture rouge sont destinées aux valeurs analysées,"]
[null,null,null,"CE",26,"g/kg MS","avec RESTORE vous initialisez les cellules modifiées qui retrouvent un état \"vide\"."]
[null,null,null,"ENA",791,"g/kg MS","Les cellules avec l'écriture blanche contiennent des formules qui calculent ou reprennent des valeurs de références, elles peuvent recevoir"]
[null,null,null,"MO",974,"g/kg MS","d'autres valeurs, avec RESTORE vous initialisez les cellules modifiées qui retrouvent les formules ou les références d'origine."]
[null,null,null,"MDS",0,"g/kg MS"]
[null,null,null,"AM",0,"g/kg MS"]
[null,null,null,"Pf",0,"g/kg MS"]
[]
["comment procéder…"]
[0,"Le fichier contient des macros, dès lors l'option macros doit être active avant de l'ouvrir."]
[null,"sous excel cliquer le bouton office (en haut à gauche), dans la fenêtre qui s'ouvre cliquer sur option excel (en bas à droite), puis sur centre de la gestion de la confidentialité, et paramètres du centre de la confidentialité, "]
[null,"puis paramètres des macros,et enfin activer toutes les macros et OK. Ouvrir le fichier AlimentsSimplesComposés20010 après l'activation. Cette opération est unique, elle reste active par la suite."]
[]
[1,"Choisir la langue, française ou allemande avec les boutons en bas à gauche"]
[2,"Possibilité de mettre une désignation personnelle dans la cellule située dans l'angle supérieur gauche, en-dessus des teneurs à donner. (facultatif)"]
[3,"Choisir un aliment de référence, en cliquant dans la cellule aliment de référence une liste déroulante apparait, cliquez sur l'aliment correspondant à votre produit"]
[4,"Introduire les valeurs pour la matière azotée, la cellulose brute et les cendres, ainsi que la graisse, l'amidon et les produits fermentaires s'ils sont connus et nécessaires"]
[5,"Les valeurs de l'aliment de référence apparaissent en gris au-dessus du bouton EXPORT"]
[6,"Une page d'impression sans coloration est automatiquement éditée, l'aperçu avant impression en permet le contrôle"]
[7,"Faites RESTORE pour un nouvel aliment et reprenez au point 2, ou donnez de nouvelles valeurs si l'aliment de référence reste le même"]
[8,"Vous avez la possibilité avec le bouton EXPORT de rassembler vos résultats dans la feuille EXPORT et de les reprendre comme valeurs excel"]
[]
[]
[]
[]
[]
[]
[]
[]
[]
[]
[]
[]
[]
[]
[]
[]
[]
[]
[]
[]
[]
[]
[]
[]
[]
[]
[]
[]
[]
[]
[]
[9,"Avec la fonction EXPORT pour pouvez reconstituer des aliments composés à partir des aliments simples que vous avez calculés (max. 20), il suffit de donner la part dans le mélange dans la feuille FORMULE."]
[null,"dans la feuille FORMULE vous retrouver les coefficents de digestibilité, de dégradabilité pondérés en fonction des taux dans le mélange."]
[10,"Pour calculer la valeur d'un mélange analysé dont les ingrédients sont connus, composez d'abord votre mélange avec la fonction EXPORT aliment après aliments en donnant les valeurs de références"]
[null,"afin d'en obtenir les coefficients de digestibilité, de dégradabilité pondérés (base nutriments digestibles ou dégradés, par ex. pour dMO pondération par la MOD, excepté dAAA pondération par MS). "]
[null,"Copiez les valeurs (dMO, dMA, dMG, dCB… deAM) pondérées obtenues dans la feuille FORMULE et collez les ( ! collage spéciale valeurs) dans la feuille aliments simples puis complétez avec les valeurs d'analyses."]
[11,"En cliquant le bouton RESTORE dans la feuille FORMULE vous initialisez (videz) automatiquement les feuilles FORMULE et EXPORT"]
[]
["réalisation AGROSCOPE ALP",null,null,"Yves.Arrigo@alp.admin.ch"]

{"sheet":"Einführung","index":1,"n_rows":113,"n_cols":16,"rows_kept":113,"cut":false,"hidden":false,"merged":[[112,3,112,5]]}
["Gebrauchsanleitung",null,null,"Die Datei enthält Makros. Vor der Anwendung des Berechnungsprogramms sind Makros unter Excel Optionen zu aktivieren (siehe weiter unten).",null,null,null,null,null,null,null,null,null,null,null,"Agroscope, ARYV, 2014"]
[]
["Dieses Berechnungsprogramm stützt sich auf die im Grünen Buch publizierten Gleichungen. Damit können die Nährwerte von Einzelfuttermitteln auf der Grundlage ihrer chemischen Zusammensetzung berechnet werden."]
["Die hinterlegten Verdaulichkeitskoeffizienten, Abbaubarkeiten und weitere Faktoren werden von Referenzfuttermitteln des Grünen Buches übernommen, die sie in der Dropdown Liste auswählen können. Diese erscheint, sobald das Feld"]
["Einzelfuttermittel Referenz angeklickt wird. Das Programm ist auf Deutsch und Französisch übersetzt. Ist allerdings ein Referenzfutter bereits ausgewählt, wird bei einem Sprachwechsel ein Fehler verursacht. In diesem Fall ist das Referenzfutter"]
["in der vom Benutzer definierten Sprache erneut anzuwählen."]
["Hinweis: Falls sich analysierte Nährstoffgehalte zu stark von den Werten des Referenzfutters unterscheiden,können die berechneten Nährwerte ungenau werden, da die verwendeten Verdaulichkeitskoeffizienten nicht beliebig übertragbar sind."]
["Die Definitionen der Nährstoffe sind abrufbar, indem der Mauszeiger auf das rote Dreieck (Kommentar) rechts der Abkürzung plaziert wird."]
["Die Definitionen zu den Nährwerten sind angegeben. Diese können, falls gewünscht,  ausgeblendet werden."]
[]
["Das Programm bietet die Möglichkeit, berechnete Werte in einem Exportblatt zusammenzufassen und daraus ein Mischfutter zusammenzustellen."]
[]
[null,null,null,null,null,"Feld für Referenzfutter, "]
["Arbeitsblatt: Aliments Futtermittel",null,null,null,null,"Zelle anklicken, um zur Dropdown Liste zu gelangen",null,null,null,null,"Definitionen der Nährwerte ausblenden/anzeigen"]
[]
[]
[null,"freies Textfeld                >"]
[]
[]
[]
[]
[]
[]
[]
[]
[]
[]
[]
[]
[]
[]
[]
[]
[]
["Nährwertangaben des Referenzfutters"]
["Basis Grünes Buch                           >"]
[]
[]
["Sprachauswahl                                 >"]
[]
["Mit der EXPORT Schaltfläche, werden "]
["Daten zusanmmengefasst, um"]
["Mischfutter zusanmmenzustellen"]
[]
["Die RESTORE Schaltfläche setzt alle"]
["Auswahlfelder in die Ausgangslage"]
["zurück"]
[]
[]
[]
[null,null,null,"RP",116,"g/kg TS"]
[null,null,null,"RL",16,"g/kg TS"]
[null,null,null,"RF",51,"g/kg TS","Die Zellen mit roter Schrift sind für Analysenwerte vorgesehen."]
[null,null,null,"RA",26,"g/kg TS","mit RESTORE werden überschriebene Zellen auf \"leer\" gesetzt."]
[null,null,null,"NfE",791,"g/kg TS","Die Zellen mit weisser Schrift enthalten Formeln,  die Refernzwerte berechnen oder übernehmen. Sie können geändert werden."]
[null,null,null,"OS",974,"g/kg TS","Mit RESTORE werden die überschriebenen Zellen wieder mit den ursprünglichen Formeln oder Refernzwerten versehen."]
[null,null,null,"MDS",0,"g/kg TS"]
[null,null,null,"ST",0,"g/kg TS"]
[null,null,null,"FP",0,"g/kg TS"]
[]
["wie vorgehen…"]
[0,"Das Programm enthält Makros. Bevor sie das Programm öffnen, stellen sie sicher, dass die Option Makros aktiviert ist."]
[null,"Unter Excel die Office Schaltfläche anklicken (oben links), im erscheinenden Fenster Excel-Optionen anklicken (unten rechts), dann weiter auf Vertrauensstellungscenter, und Einstellungen für Vertrauensstellungscenter, "]
[null,"dann Einstellungen für Makros, und zuletzt alle Makros aktivieren und OK. Nach der Aktivierung die Datei Einzelfutter_Mischfutter2010 öffnen. Dieser Vorgang muss nur einmal gemacht werden, die Einstellung bleibt aktiv."]
[]
[1,"Sprache, Deutsch oder Französisch, über Schaltfläche unten links auswählen"]
[2,"In der oberen linken Ecke kann ein Eintrag in die Zelle oberhalb der einzutragenden Gehaltswerte gemacht werden (fakultativ)"]
[3,"Refernzfutter auswählen, indem in das Feld Referenzfutter geklickt wird. In der erscheinenden Dropdown Liste das Futter anklicken, das ihrem Produkt entspricht."]
[4,"Gehaltswerte für Rohprotein, Rohfaser, Rohasche, Rohfett, Stärke und Fermentionsprodukte (falls bekannt und nötig) eintragen."]
[5,"Die Nährwertangaben des Refernzfutters erscheinen in grau oberhalb der EXPORT Schaltfläche."]
[6,"Eine Druckversion ohne Einfärbung wird automatisch generiert. In der Druckansicht kann das Resultat überprüft werden."]
[7,"Mit RESTORE kann ein neues Futter gemäss Punkt 2ff berechnet werden oder neue Gehaltswerte werden eingetragen, wenn das Referenzfutter gleich bleibt."]
[8,"Mit EXPORT können die Ergebnisse im Blatt EXPORT zusammengefasst und als Excel-Werte übernommen werden."]
[]
[]
[]
[]
[]
[]
[]
[]
[]
[]
[]
[]
[]
[]
[]
[]
[]
[]
[]
[]
[]
[]
[]
[]
[]
[]
[]
[]
[]
[]
[]
[9,"Mit der EXPORT Funktion können Mischfutter anhand der berechneten Einzelfutter wieder zusammengestellt werden (max 20). Dazu muss nur der Mischungsanteil im Blatt FORMULE angegeben werden."]
[null,"Im Blatt FORMULE sind die gewichteten Verdaulichkeitskoeffizenten und Abbaubarkeiten in Abhängigkeit des Mischunganteiles angegeben."]
[10,"Um den Nährwert einer analysierten Futtermischung mit bekannten Rohkomponenten und Mischungsanteilen zu berechnen, zuerst die Mischung mit der EXPORT Funktion Einzelfutter für Einzelfutter "]
[null,"mit den entsprechenden Referenzwerten zusammenstellen, um gewichtete Verdaulichkeitskoeffizienten und Abbaubarkeiten auf der Basis der verdaulichen Nährstoffe zu erhalten (Ausnahme: vASF Gewichtung auf Basis TS). "]
[null,"Zum Beispiel wird die vOS über die VOS gewichtet. Die gewichteten Werte (vOS, vRP, vRL, vRF… aRP) im Blatt FORMULE kopieren und im Blatt Einzelfutter einfügen (! Einfügen Inhalte_Werte) "]
[null,"und als letzter Schritt die analysierten Gehalte eintragen."]
[11,"Durch Anklicken der RESTORE Schaltfläche im Blatt FORMULE werden die Blätter FORMULE und EXPORT automatisch inititialisiert, d.h. auf leer gesetzt."]
[]
["Programmierung AGROSCOPE",null,null,"yves.arrigo@agroscope.admin.ch"]

{"sheet":"Aliments Futtermittel","index":2,"n_rows":418,"n_cols":92,"rows_kept":418,"cut":false,"hidden":false,"merged":[[0,4,0,10],[0,25,0,30],[1,0,1,2],[1,21,1,23],[1,43,1,45]]}
[{"$f":"IF(H42=1,\"Aliment simple\",\"Einzelfuttermittel\")","v":"Aliment simple"},null,null,{"$f":"IF(H42=1,\"Référence:\",\"Referenz:\")","v":"Référence:"},"Avoine, grain",null,null,null,null,null,null,null,null,null,{"$f":"IF(H42=1,\"version 8.01.2014\",\"Version 8.01.2014\")","v":"version 8.01.2014"},null,null,null,null,null,null,{"$f":"A1","v":"Aliment simple"},null,null,null,{"$f":"E1","v":"Avoine, grain"},null,null,null,null,null,null,{"$f":"O1","v":"version 8.01.2014"},null,"Yves.Arrigo@alp.admin.ch"]
[{"$f":"E1","v":"Avoine, grain"},null,null,null,{"$f":"IF(J45=\"T\",IF(H42=1,\"choisissez une référence en français ^\",\"Wählen Sie eine Referenz auf Deutsch ^\"),\"\")","v":""},null,null,null,null,null,null,null,null,"  ",null,null,null,null,null,null,null,{"$f":"A2","v":"Avoine, grain"},null,null,null,null,null,null,null,null,null,null,null,null,"  ",null,null,null,null,null,null,null,null,{"$f":"AV1","v":0}]
[]
[{"$f":"IF($H$42=1,\"MS\",\"TS\")","v":"MS"},null,1000,{"$f":"IF(C4>1000,\"MS>\",\"g\")","v":"g"},null,null,null,null,"NEL",{"$f":"IF($H$32<12,\"\",C64*$C$4/1000)","v":6.7260016522933039},{"$f":"IF(C4<>1000,\"MJ/kg\",IF(H42=1,\"MJ/kg MS\",\"MJ/kg TS\"))","v":"MJ/kg MS"},{"$f":"IF($K$32=FALSE,\"\",J33)","v":"énergie nette lait"},null,null,null,null,null,null,null,null,null,{"$f":"A4","v":"MS"},null,{"$f":"C4","v":1000},"g",null,null,null,null,null,{"$f":"I4","v":"NEL"},6.7260016522933039,"MJ/kg MS","énergie nette lait",null,null,null,null,null,null,null,null,null,{"$f":"IF($H$42=1,\"MS\",\"TS\")","v":"MS"},null,1000,{"$f":"IF(AT4>1000,\"MS>\",\"g\")","v":"g"},null,null,null,null,{"$f":"IF($H$42=1,\"MS\",\"TS\")","v":"MS"},null,1000,{"$f":"IF(BB4>1000,\"MS>\",\"g\")","v":"g"}]
[null,null,null,null,null,null,null,null,"NEV",{"$f":"IF($H$32<12,\"\",C69*$C$4/1000)","v":7.0208017260391804},{"$f":"K4","v":"MJ/kg MS"},"énergie nette viande",null,null,null,null,null,null,null,null,null,null,null,null,null,null,null,null,null,null,"NEV",7.0208017260391804,"MJ/kg MS","énergie nette viande"]
[{"$f":"IF($H$42=1,\"MA\",\"RP\")","v":"MA"},null,{"$f":"VLOOKUP($E$1,listealim,9,FALSE)","v":119.4},{"$f":"IF($C$4<>1000,\"g/kg\",IF(H42=1,\"g/kg MS\",\"g/kg TS\"))","v":"g/kg MS"},{"$f":"IF($H$42=1,\"dMO\",\"vOS\")","v":"dMO"},null,{"$f":"VLOOKUP($E$1,listealim,21,FALSE)","v":72},"%",{"$f":"IF($H$42=1,\"PAIE\",\"APDE\")","v":"PAIE"},{"$f":"IF($H$32<12,\"\",C72*$C$4/1000)","v":78.933138},{"$f":"D6","v":"g/kg MS"},"protéines absorbables dans l'intestin synthétisées à partir de l'énergie disponible",null,null,null,null,null,null,null,null,null,{"$f":"A6","v":"MA"},null,{"$f":"C6","v":119.4},{"$f":"D6","v":"g/kg MS"},null,{"$f":"E6","v":"dMO"},{"$f":"G6","v":72},"%",null,"PAIE",78.933138,"g/kg MS","protéines absorbables dans l'intestin synthétisées à partir de l'énergie disponible",null,null,null,null,null,null,null,null,null,{"$f":"IF($H$42=1,\"MA\",\"RP\")","v":"MA"},null,{"$f":"VLOOKUP($E$1,listealim,9,FALSE)","v":119.4},{"$f":"IF($C$4<>1000,\"g/kg\",IF(AY42=1,\"g/kg MS\",\"g/kg TS\"))","v":"g/kg TS"},{"$f":"IF($H$42=1,\"dMO\",\"vOS\")","v":"dMO"},null,{"$f":"VLOOKUP($E$1,listealim,21,FALSE)","v":72},null,{"$f":"IF($H$42=1,\"MA\",\"RP\")","v":"MA"},null,{"$f":"VLOOKUP($E$1,listealim,9,FALSE)","v":119.4},{"$f":"IF($C$4<>1000,\"g/kg\",IF(BG42=1,\"g/kg MS\",\"g/kg TS\"))","v":"g/kg TS"},{"$f":"IF($H$42=1,\"dMO\",\"vOS\")","v":"dMO"},null,{"$f":"VLOOKUP($E$1,listealim,21,FALSE)","v":72}]
[{"$f":"IF($H$42=1,\"MG\",\"RL\")","v":"MG"},null,{"$f":"VLOOKUP($E$1,listealim,10,FALSE)","v":50.4},{"$f":"D6","v":"g/kg MS"},{"$f":"IF($H$42=1,\"dMA\",\"vRP\")","v":"dMA"},null,{"$f":"VLOOKUP($E$1,listealim,22,FALSE)","v":78},"%",{"$f":"IF($H$42=1,\"PAIN\",\"APDN\")","v":"PAIN"},{"$f":"IF($H$32<12,\"\",C74*$C$4/1000)","v":77.347320000000011},{"$f":"K6","v":"g/kg MS"},"protéines absorbables dans l'intestin, synthétisées à partir de la matière azotée dégradée",null,null,null,null,null,null,null,null,null,{"$f":"A7","v":"MG"},null,{"$f":"C7","v":50.4},{"$f":"D7","v":"g/kg MS"},null,"dMA",78,"%",null,"PAIN",77.347320000000011,"g/kg MS","protéines absorbables dans l'intestin, synthétisées à partir de la matière azotée dégradée",null,null,null,null,null,null,null,null,null,{"$f":"IF($H$42=1,\"MG\",\"RL\")","v":"MG"},null,{"$f":"VLOOKUP($E$1,listealim,10,FALSE)","v":50.4},{"$f":"AU6","v":"g/kg TS"},{"$f":"IF($H$42=1,\"dMA\",\"vRP\")","v":"dMA"},null,{"$f":"VLOOKUP($E$1,listealim,22,FALSE)","v":78},null,{"$f":"IF($H$42=1,\"MG\",\"RL\")","v":"MG"},null,{"$f":"VLOOKUP($E$1,listealim,10,FALSE)","v":50.4},{"$f":"BC6","v":"g/kg TS"},{"$f":"IF($H$42=1,\"dMA\",\"vRP\")","v":"dMA"},null,{"$f":"VLOOKUP($E$1,listealim,22,FALSE)","v":78}]
[{"$f":"IF($H$42=1,\"CB\",\"RF\")","v":"CB"},null,{"$f":"VLOOKUP($E$1,listealim,11,FALSE)","v":118.8},{"$f":"D7","v":"g/kg MS"},{"$f":"IF($H$42=1,\"dMG\",\"vRL\")","v":"dMG"},null,{"$f":"VLOOKUP($E$1,listealim,23,FALSE)","v":81},"%","PME",{"$f":"IF($H$32<12,\"\",C75*$C$4/1000)","v":85.872769999999988},{"$f":"K7","v":"g/kg MS"},"quantité de protéines microbiennes être synthétisées à partir de l'énergie fermentescible",null,null,null,null,null,null,null,null,null,"CB",null,118.8,"g/kg MS",null,"dMG",81,"%",null,null,null,null,null,null,null,null,null,null,null,null,null,null,{"$f":"IF($H$42=1,\"CB\",\"RF\")","v":"CB"},null,{"$f":"VLOOKUP($E$1,listealim,11,FALSE)","v":118.8},{"$f":"AU7","v":"g/kg TS"},{"$f":"IF($H$42=1,\"dMG\",\"vRL\")","v":"dMG"},null,{"$f":"VLOOKUP($E$1,listealim,23,FALSE)","v":81},null,{"$f":"IF($H$42=1,\"CB\",\"RF\")","v":"CB"},null,{"$f":"VLOOKUP($E$1,listealim,11,FALSE)","v":118.8},{"$f":"BC7","v":"g/kg TS"},{"$f":"IF($H$42=1,\"dMG\",\"vRL\")","v":"dMG"},null,{"$f":"VLOOKUP($E$1,listealim,23,FALSE)","v":81}]
[{"$f":"IF($H$42=1,\"CE\",\"RA\")","v":"CE"},null,{"$f":"VLOOKUP($E$1,listealim,15,FALSE)","v":29.4},"g/kg MS",{"$f":"IF($H$42=1,\"dCB\",\"vRF\")","v":"dCB"},null,{"$f":"VLOOKUP($E$1,listealim,24,FALSE)","v":31},"%","PMN",{"$f":"IF($H$32<12,\"\",C76*$C$4/1000)","v":92.893200000000007},"g/kg MS","quantité de protéines microbiennes être synthétisées à partir de la matière azotée dégradable",null,null,null,null,null,null,null,null,null,"CE",null,29.4,"g/kg MS",null,"dCB",31,"%",null,{"$f":"I8","v":"PME"},85.872769999999988,"g/kg MS","quantité de protéines microbiennes être synthétisées à partir de l'énergie fermentescible",null,null,null,null,null,null,null,null,null,{"$f":"IF($H$42=1,\"CE\",\"RA\")","v":"CE"},null,{"$f":"VLOOKUP($E$1,listealim,15,FALSE)","v":29.4},"g/kg TS",{"$f":"IF($H$42=1,\"dCB\",\"vRFL\")","v":"dCB"},null,{"$f":"VLOOKUP($E$1,listealim,24,FALSE)","v":31},null,{"$f":"IF($H$42=1,\"CE\",\"RA\")","v":"CE"},null,{"$f":"VLOOKUP($E$1,listealim,15,FALSE)","v":29.4},"g/kg TS",{"$f":"IF($H$42=1,\"dCB\",\"vRFL\")","v":"dCB"},null,{"$f":"VLOOKUP($E$1,listealim,24,FALSE)","v":31}]
[{"$f":"IF($H$42=1,\"ENA\",\"NfE\")","v":"ENA"},null,{"$f":"C53*C4/1000","v":682.00000000000011},"g/kg MS",{"$f":"IF($H$42=1,\"dENA\",\"vNfE\")","v":"dENA"},null,{"$f":"VLOOKUP($E$1,listealim,25,FALSE)","v":78},"%",null,null,null,null,null,null,null,null,null,null,null,null,null,"ENA",null,682.00000000000011,"g/kg MS",null,"dENA",78,"%",null,"PMN",92.893200000000007,"g/kg MS","quantité de protéines microbiennes être synthétisées à partir de la matière azotée dégradable",null,null,null,null,null,null,null,null,null,{"$f":"IF($H$42=1,\"ENA\",\"NfE\")","v":"ENA"},null,{"$f":"AT53*AT4/1000","v":0},"g/kg TS",{"$f":"IF($H$42=1,\"dENA\",\"vNfE\")","v":"dENA"},null,{"$f":"VLOOKUP($E$1,listealim,25,FALSE)","v":78},null,{"$f":"IF($H$42=1,\"ENA\",\"NfE\")","v":"ENA"},null,{"$f":"BB53*BB4/1000","v":0},"g/kg TS",{"$f":"IF($H$42=1,\"dENA\",\"vNfE\")","v":"dENA"},null,{"$f":"VLOOKUP($E$1,listealim,25,FALSE)","v":78}]
[{"$f":"IF($H$42=1,\"MO\",\"OS\")","v":"MO"},null,{"$f":"C52*C4/1000","v":970.6},"g/kg MS",{"$f":"IF($H$42=1,\"deMA\",\"aRP\")","v":"deMA"},null,{"$f":"VLOOKUP($E$1,listealim,26,FALSE)","v":80},"%",{"$f":"IF($H$42=1,\"PAIA\",\"APDF\")","v":"PAIA"},{"$f":"IF($H$32<12,\"\",C77*$C$4/1000)","v":23.856120000000001},{"$f":"K9","v":"g/kg MS"},{"$f":"IF($K$32=FALSE,\"\",J40)","v":"protéines alimentaires absorbables dans l'intestin d'origine alimentaire"},null,null,null,null,null,null,null,null,null,"MO",null,970.6,"g/kg MS",null,"deMA",80,"%",null,{"$f":"I11","v":"PAIA"},23.856120000000001,"g/kg MS","protéines alimentaires absorbables dans l'intestin d'origine alimentaire",null,null,null,null,null,null,null,null,null,{"$f":"IF($H$42=1,\"MO\",\"OS\")","v":"MO"},null,{"$f":"AT52*AT4/1000","v":0},"g/kg TS",{"$f":"IF($H$42=1,\"deMA\",\"aRP\")","v":"deMA"},null,{"$f":"VLOOKUP($E$1,listealim,26,FALSE)","v":80},null,{"$f":"IF($H$42=1,\"MO\",\"OS\")","v":"MO"},null,{"$f":"BB52*BB4/1000","v":0},"g/kg TS",{"$f":"IF($H$42=1,\"deMA\",\"aRP\")","v":"deMA"},null,{"$f":"VLOOKUP($E$1,listealim,26,FALSE)","v":80}]
["MDS",1,0,"g/kg MS",{"$f":"IF($H$42=1,\"dAAA\",\"vASF\")","v":"dAAA"},null,{"$f":"VLOOKUP($E$1,listealim,27,FALSE)","v":90},"%",{"$f":"IF($H$42=1,\"PAIM\",\"APDM\")","v":"PAIM"},{"$f":"IF($H$32<12,\"\",C78*$C$4/1000)","v":55.077018000000002},"g/kg MS",{"$f":"IF($K$32=FALSE,\"\",J41)","v":"protéines absorbables dans l'intestin d'origine microbienne"},null,null,null,null,null,null,null,null,null,"MDS",1,0,"g/kg MS",null,"dAAA",90,"%",null,"PAIM",55.077018000000002,"g/kg MS","protéines absorbables dans l'intestin d'origine microbienne",null,null,null,null,null,null,null,null,null,"MDS",1,0,"g/kg TS",{"$f":"IF($H$42=1,\"dAAA\",\"vASF\")","v":"dAAA"},null,{"$f":"VLOOKUP($E$1,listealim,27,FALSE)","v":90},null,"MDS",1,0,"g/kg TS",{"$f":"IF($H$42=1,\"dAAA\",\"vASF\")","v":"dAAA"},null,{"$f":"VLOOKUP($E$1,listealim,27,FALSE)","v":90}]
[{"$f":"IF($H$42=1,\"AM\",\"ST\")","v":"AM"},2,{"$f":"VLOOKUP($E$1,listealim,28,FALSE)","v":461.8},"g/kg MS",{"$f":"IF($H$42=1,\"deAM\",\"aST\")","v":"deAM"},2,{"$f":"VLOOKUP($E$1,listealim,29,FALSE)","v":93},"%",{"$f":"IF($H$42=1,\"PAIMN\",\"APDMN\")","v":"PAIMN"},{"$f":"IF($H$32<12,\"\",C79*$C$4/1000)","v":53.491200000000006},"g/kg MS",{"$f":"IF($K$32=FALSE,\"\",J42)","v":"protéines absorbables dans l'intestin synthétisées à partir de la matière azotée dégradable"},null,null,null,null,null,null,null,null,null,"AM",2,461.8,"g/kg MS",null,"deAM",93,"%",null,"PAIMN",53.491200000000006,"g/kg MS","protéines absorbables dans l'intestin synthétisées à partir de la matière azotée dégradable",null,null,null,null,null,null,null,null,null,{"$f":"IF($H$42=1,\"AM\",\"ST\")","v":"AM"},2,{"$f":"VLOOKUP($E$1,listealim,28,FALSE)","v":461.8},"g/kg TS",{"$f":"IF($H$42=1,\"deAM\",\"aST\")","v":"deAM"},2,{"$f":"VLOOKUP($E$1,listealim,29,FALSE)","v":93},null,{"$f":"IF($H$42=1,\"AM\",\"ST\")","v":"AM"},2,{"$f":"VLOOKUP($E$1,listealim,28,FALSE)","v":461.8},"g/kg TS",{"$f":"IF($H$42=1,\"deAM\",\"aST\")","v":"deAM"},2,{"$f":"VLOOKUP($E$1,listealim,29,FALSE)","v":93}]
[{"$f":"IF($H$42=1,\"Pf\",\"FP\")","v":"Pf"},3,{"$f":"VLOOKUP($E$1,listealim,20,FALSE)","v":0},"g/kg MS",null,null,null,null,{"$f":"IF($H$42=1,\"EM\",\"UE\")","v":"EM"},{"$f":"IF($H$32<12,\"\",C61*$C$4/1000)","v":11.347902000000001},{"$f":"K4","v":"MJ/kg MS"},{"$f":"IF($K$32=FALSE,\"\",J43)","v":"énergie métabolisable"},null,null,null,null,null,null,null,null,null,"Pf",3,0,"g/kg MS",null,null,null,null,null,"EM",11.347902000000001,"MJ/kg MS","énergie métabolisable",null,null,null,null,null,null,null,null,null,{"$f":"IF($H$42=1,\"Pf\",\"FP\")","v":"Pf"},3,{"$f":"VLOOKUP($E$1,listealim,20,FALSE)","v":0},"g/kg TS",null,null,null,null,{"$f":"IF($H$42=1,\"Pf\",\"FP\")","v":"Pf"},3,{"$f":"VLOOKUP($E$1,listealim,20,FALSE)","v":0},"g/kg TS"]
[null,null,null,null,null,null,null,null,{"$f":"IF($H$42=1,\"EB\",\"BE\")","v":"EB"},{"$f":"IF($H$32<12,\"\",C60*$C$4/1000)","v":18.811040000000006},{"$f":"K14","v":"MJ/kg MS"},{"$f":"IF($K$32=FALSE,\"\",J44)","v":"énergie brute"},null,null,null,null,null,null,null,null,null,null,null,null,null,null,null,null,null,null,"EB",18.811040000000006,"MJ/kg MS","énergie brute"]
[null,1,{"$f":"IF(H42=1,\" MDS = Mono- et dissacharides prod. laitiers à prendre en considération que si >= 80 g/kg MS (lactose)\",\"Mono- und Disaccharide nur bei Milchprodukten zu berücksichtigen falls >80 g/kg TS\")","v":" MDS = Mono- et dissacharides prod. laitiers à prendre en considération que si >= 80 g/kg MS (lactose)"}]
[null,2,{"$f":"IF(H42=1,\"Que pour aliment riche en amidon, avec une dégradabilité de l'amidon <=85%\",\"nur bei stärkereichen Füttermitteln wenn die Abbaubarkeit <=85% beträgt\")","v":"Que pour aliment riche en amidon, avec une dégradabilité de l'amidon <=85%"},null,null,null,null,null,null,null,null,null,null,null,null,null,null,null,null,null,null,null,null,{"$f":"C16","v":" MDS = Mono- et dissacharides prod. laitiers à prendre en considération que si >= 80 g/kg MS (lactose)"}]
[null,3,{"$f":"IF(H42=1,\"Produits de fermentation, acide lactique, acides gras volatils et les alcools.\",\"Die Fermentationsprodukte der Silagen setzen sich zusammen aus Milchsäure, flüchtigen Fettsäuren, Alkoholen\")","v":"Produits de fermentation, acide lactique, acides gras volatils et les alcools."},null,null,null,null,null,null,null,null,null,null,null,null,null,null,null,null,null,null,null,null,{"$f":"C17","v":"Que pour aliment riche en amidon, avec une dégradabilité de l'amidon <=85%"}]
[{"$f":"IF(H42=1,\"valeurs tables 11\",\"Tabellenwerte 11\")","v":"valeurs tables 11"},null,{"$f":"CONCATENATE(A43,ROUND(VLOOKUP($E$1,listealim,9,FALSE),0))","v":"MA: 119"},{"$f":"CONCATENATE(A44,ROUND(VLOOKUP($E$1,listealim,11,FALSE),0))","v":"CB: 119"},{"$f":"CONCATENATE(A45,ROUND(VLOOKUP($E$1,listealim,15,FALSE),0))","v":"CE: 29"},null,{"$f":"CONCATENATE(\"NEL:  \",ROUND(VLOOKUP($E$1,listealim,3,FALSE),1))","v":"NEL:  6.7"},{"$f":"CONCATENATE(\"NEV:  \",ROUND(VLOOKUP($E$1,listealim,4,FALSE),1))","v":"NEV:  7"},{"$f":"CONCATENATE(C43,\"  \",ROUND(VLOOKUP($E$1,listealim,5,FALSE),0))","v":"PAIE  82"},{"$f":"CONCATENATE(C44,\"  \",ROUND(VLOOKUP($E$1,listealim,6,FALSE),0))","v":"PAIN  77"},null,null,null,null,null,null,null,null,null,null,null,null,null,{"$f":"C18","v":"Produits de fermentation, acide lactique, acides gras volatils et les alcools."}]
[]
[null,null,null,null,{"$f":"IF(H32<12,IF(H42=1,\"Données incomplètes pour les calculs !\",\"fehlende Daten für die Berchnungen !\"),\"\")","v":""}]
[]
[null,null,null,null,{"$f":"E45","v":""}]
[]
[null,null,null,null,null,null,null,null,null,null,null,"yves.arrigo@agroscope.admin.ch"]
[]
[]
[]
[]
[]
[]
["valeurs incomplètes",null,null,null,null,null,null,{"$f":"SUM(C33:C36,G33:G40)","v":12},null,"définitions",true,"oui=vrai; non=faux"]
["MA",null,{"$f":"IF(ISBLANK(C6),0,1)","v":1},null,"dMO",null,{"$f":"IF(ISBLANK(G6),0,1)","v":1},null,"NEL",{"$f":"IF($H$42=1,Q33,Y33)","v":"énergie nette lait"},null,null,null,null,null,null,"énergie nette lait",null,null,null,null,null,null,"NEL","Netto-Energie Milch (Laktation)"]
["MG",null,{"$f":"IF(ISBLANK(C7),0,1)","v":1},null,"dMA",null,{"$f":"IF(ISBLANK(G7),0,1)","v":1},null,"NEV",{"$f":"IF($H$42=1,Q34,Y34)","v":"énergie nette viande"},null,null,null,null,null,null,"énergie nette viande",null,null,null,null,null,null,"NEV","Netto-Energie Mast (Wachstum)"]
["CB",null,1,null,"dMG",null,1,null,"PAIE","protéines absorbables dans l'intestin synthétisées à partir de l'énergie disponible",null,null,null,null,null,null,"protéines absorbables dans l'intestin synthétisées à partir de l'énergie disponible",null,null,null,null,null,null,"APDE","Absorbierbares Protein im Darm, das auf Grund der verfügbaren Energiemengen aufgebaut werden kann"]
["CE",null,1,null,"dCB",null,1,null,"PAIN","protéines absorbables dans l'intestin, synthétisées à partir de la matière azotée dégradée",null,null,null,null,null,null,"protéines absorbables dans l'intestin, synthétisées à partir de la matière azotée dégradée",null,null,null,null,null,null,"APDN","Absorbierbares Protein im Darm, das auf Grund des abgebauten Rohproteins aufgebaut werden kann"]
[null,null,null,null,"dENA",null,1,null,"PME","quantité de protéines microbiennes être synthétisées à partir de l'énergie fermentescible",null,null,null,null,null,null,"quantité de protéines microbiennes être synthétisées à partir de l'énergie fermentescible",null,null,null,null,null,null,"PME","Mikroorganismen-Protein aus fermenttierbarer Energie"]
[null,null,null,null,"deMA",null,1,null,"PMN","quantité de protéines microbiennes être synthétisées à partir de la matière azotée dégradable",null,null,null,null,null,null,"quantité de protéines microbiennes être synthétisées à partir de la matière azotée dégradable",null,null,null,null,null,null,"PMN","Mikroorganismen-Protein aus abbaubarem Rohprotein"]
[null,null,null,null,"dAAA",null,1]
[null,null,null,null,"deAM",null,1,null,"PAIA","protéines alimentaires absorbables dans l'intestin d'origine alimentaire",null,null,null,null,null,null,"protéines alimentaires absorbables dans l'intestin d'origine alimentaire",null,null,null,null,null,null,"APDF","Absorbierbares Protein im Darm aus dem Futter"]
[null,null,null,null,null,null,null,null,"PAIM","protéines absorbables dans l'intestin d'origine microbienne",null,null,null,null,null,null,"protéines absorbables dans l'intestin d'origine microbienne",null,null,null,null,null,null,"APDM","Mikrobielles absorbierbares Protein im Darm"]
["langue",null,"français=1, deutch=2",null,null,null,null,1,"PAIMN","protéines absorbables dans l'intestin synthétisées à partir de la matière azotée dégradable",null,null,null,null,null,null,"protéines absorbables dans l'intestin synthétisées à partir de la matière azotée dégradable",null,null,null,null,null,null,"APDMN","Absorbierbares Protein im Darm, das aus dem abbaubaren Rohprotein aufgebaut werden kann"]
[{"$f":"IF($H$42=1,\"MA: \", \"RP: \")","v":"MA: "},null,{"$f":"IF(H42=1,\"PAIE\",\"APDE\")","v":"PAIE"},null,null,null,null,null,"EM","énergie métabolisable",null,null,null,null,null,null,"énergie métabolisable",null,null,null,null,null,null,"UE","Umsetzbare Energie"]
[{"$f":"IF($H$42=1,\"CB: \", \"RF: \")","v":"CB: "},null,{"$f":"IF(H42=1,\"PAIN\",\"APDN\")","v":"PAIN"},null,null,null,null,null,"EB","énergie brute",null,null,null,null,null,null,"énergie brute",null,null,null,null,null,null,"BE","Bruttoenergie"]
[{"$f":"IF($H$42=1,\"CE: \", \"RA: \")","v":"CE: "},null,null,null,{"$f":"IF(H42=1,IF(G7=\"néant *\",\"voir feuille Annexe1!\",\"\"),IF(G7=\"keine *\",\"sehe Blatt Annexe1!\",\"\"))","v":""},null,null,null,null,{"$f":"IFERROR(C7,\"T\")","v":50.4}]
[]
["teneurs de base",null,null,null,"teneurs digestibles"]
["MA, g/kg MS",null,{"$f":"C6/C4*1000","v":119.4},">",{"$f":"C48*G7/100","v":93.132000000000005},null,"MAD, g/kg MS"]
["MG, g/kg MS",null,{"$f":"C7/C4*1000","v":50.4},">",{"$f":"C49*G8/100","v":40.823999999999998},null,"MGD,g/kg MS"]
["CB, g/kg MS",null,{"$f":"C8/C4*1000","v":118.8},">",{"$f":"C50*G9/100","v":36.827999999999996},null,"CBD, g/kg MS"]
["CE, g/kg MS",null,{"$f":"C9/C4*1000","v":29.4}]
["MO, g/kg MS",null,{"$f":"1000-C51","v":970.6},">",{"$f":"C52*G6/100","v":698.83199999999999},null,"MOD, g/kg MS"]
["ENA, g/kg MS",null,{"$f":"C52-C48-C49-C50","v":682.00000000000011},">",{"$f":"C53*G10/100","v":531.96},null,"ENAD, g/kg MS"]
["MDS",null,{"$f":"C12/C4*1000","v":0}]
["AM",null,{"$f":"C13/C4*1000","v":461.8}]
["PF",null,{"$f":"C14","v":0}]
[]
[]
[null,null,null,null,"formules Lv"]
["EB",null,{"$f":"0.0242*C48+0.0366*C49+0.0209*C50+0.017*C53-0.00063*C54","v":18.811040000000006},"<","EB",null,"= 0.0242 MA + 0.0366 MG + 0.0209 CB + 0.0170 ENA – 0.00063 MDSa)"]
["EM",null,{"$f":"0.0159*E48+0.0377*E49+0.0138*E50+0.0147*E53-0.00063*C54","v":11.347902000000001},"<","EM",null,"= 0.0159 MAD + 0.0377 MGD + 0.0138 CBD + 0.0147 ENAD – 0.00063 MDSa)"]
["q",null,{"$f":"C61/C60","v":0.60325755513783386},"<","q",null," =EM/EB"]
["KL",null,{"$f":" 0.463 + 0.24*C62","v":0.60778181323308011},"<","KL",null,"= 0.463 + 0.24 q "]
["NEL",null,{"$f":" 0.9752*C63*C61","v":6.7260016522933039},"<","NEL",null,"= 0.9752 x kL x EM"]
[]
["KEn",null,{"$f":" 0.554 + 0.287*C62","v":0.72713491832455834},"<","KEn",null,"= 0.554 + 0.287 q"]
["KV",null,{"$f":" 0.006 + 0.78*C62","v":0.4765408930075104},"<","KV",null,"= 0.006 + 0.78 q"]
["KEnV",null,{"$f":"(1.5*C66*C67)/((0.5*C66)+C67)","v":0.6186872010384985},"<","KEnV",null,"= (1.5 x kEn x kV) / ([0.5 x kEn] + kV)"]
["NEV",null,{"$f":"C68*C61","v":7.0208017260391804},"<","NEV",null," = kEnV x EM"]
[]
["MOF",null,{"$f":" C52*G6/100-C48*(1-G11/100)-C49-C55*(1-G13/100)-(C14*0.5)","v":592.226},"<","MOF",null,"= MO x dMO/100 – MA x (1 – deMA/100 ) – MGa) – AMb) x (1- deAMI/100) –(PFc) x 0.5)"]
["PAIE",null,{"$f":"0.093*C71+C48*(1.11*(1-G11/100))*G12/100","v":78.933138},"<","PAIE",null,"= 0.093 x MOF + MA x (1.11 x (1- deMA/100)) x dAAA/100"]
[]
["PAIN",null,{"$f":"C48*(G11/100-0.1)*0.64+C48*(1.11*(1-G11/100))*G12/100","v":77.347320000000011},"<","PAIN",null,"= MA x (deMA/100 – 0.10) x 0.64 + MA x (1.11 x [ 1–deMA/100]) x dAAA/100"]
["PME",null,{"$f":"0.145*C71","v":85.872769999999988},"<","PME",null," =0.145 x MOF"]
["PMN",null,{"$f":"C48*(1-(1.11*(1-G11/100)))","v":92.893200000000007},"<","PMN",null," =MA x (1-(1.11 x (1-deMA/100)))"]
["PAIA",null,{"$f":"C48*(1.11*(1-G11/100))*G12/100","v":23.856120000000001},"<","PAIA",null," =MA x (1.11 x (1-deMA/100)) x dAAA/100"]
["PAIM",null,{"$f":"0.093*C71","v":55.077018000000002},"<","PAIM",null," =0.093 x MOF"]
["PAIMN",null,{"$f":"C48*(G11/100-0.1)*0.64","v":53.491200000000006},"<","PAIMN",null,"  =MA  x (deMA/100 - 0.1) x 0.64"]
[]
[]
[]
["reprise des données pour les ajouter à la feuille EXPORT"]
[{"$f":"IF(H42=1,\"aliments\",\"Futtermittel\")","v":"aliments"},{"$f":"IF(H42=1,\"% dans le mélange\",\"% in der Mischung\")","v":"% dans le mélange"},{"$f":"A4","v":"MS"},{"$f":"A6","v":"MA"},{"$f":"A7","v":"MG"},{"$f":"A8","v":"CB"},{"$f":"A9","v":"CE"},{"$f":"A10","v":"ENA"},{"$f":"A11","v":"MO"},{"$f":"A12","v":"MDS"},{"$f":"A13","v":"AM"},{"$f":"A14","v":"Pf"},{"$f":"E6","v":"dMO"},{"$f":"E7","v":"dMA"},{"$f":"E8","v":"dMG"},{"$f":"E9","v":"dCB"},{"$f":"E10","v":"dENA"},{"$f":"E11","v":"deMA"},{"$f":"E12","v":"dAAA"},{"$f":"E13","v":"deAM"},{"$f":"I4","v":"NEL"},{"$f":"I5","v":"NEV"},{"$f":"I6","v":"PAIE"},{"$f":"I7","v":"PAIN"},{"$f":"I8","v":"PME"},{"$f":"I9","v":"PMN"},{"$f":"I11","v":"PAIA"},{"$f":"I12","v":"PAIM"},{"$f":"I13","v":"PAIMN"},{"$f":"I14","v":"EM"},{"$f":"I15","v":"EB"},{"$f":"IF($H$42=1,\"NEL réf.\",\"NEL Ref.\")","v":"NEL réf."},{"$f":"IF($H$42=1,\"NEV réf.\",\"NEV Ref.\")","v":"NEV réf."},{"$f":"IF($H$42=1,\"PAIE réf.\",\"APDE Ref.\")","v":"PAIE réf."},{"$f":"IF($H$42=1,\"PAIN réf.\",\"APDN Ref.\")","v":"PAIN réf."},{"$f":"IF($H$42=1,\"EM réf.\",\"UE Ref.\")","v":"EM réf."},{"$f":"IF($H$42=1,\"EB réf.\",\"BE Ref.\")","v":"EB réf."}]
[{"$f":"A2","v":"Avoine, grain"},null,{"$f":"C4","v":1000},{"$f":"C6","v":119.4},{"$f":"C7","v":50.4},{"$f":"C8","v":118.8},{"$f":"C9","v":29.4},{"$f":"C10","v":682.00000000000011},{"$f":"C11","v":970.6},{"$f":"C12","v":0},{"$f":"C13","v":461.8},{"$f":"C14","v":0},{"$f":"G6","v":72},{"$f":"G7","v":78},{"$f":"G8","v":81},{"$f":"G9","v":31},{"$f":"G10","v":78},{"$f":"G11","v":80},{"$f":"G12","v":90},{"$f":"G13","v":93},{"$f":"J4","v":6.7260016522933039},{"$f":"J5","v":7.0208017260391804},{"$f":"J6","v":78.933138},{"$f":"J7","v":77.347320000000011},{"$f":"J8","v":85.872769999999988},{"$f":"J9","v":92.893200000000007},{"$f":"J11","v":23.856120000000001},{"$f":"J12","v":55.077018000000002},{"$f":"J13","v":53.491200000000006},{"$f":"J14","v":11.347902000000001},{"$f":"J15","v":18.811040000000006},{"$f":"VLOOKUP($E$1,listealim,3,FALSE)","v":6.73},{"$f":"VLOOKUP($E$1,listealim,4,FALSE)","v":7.02},{"$f":"VLOOKUP($E$1,listealim,5,FALSE)","v":81.900000000000006},{"$f":"VLOOKUP($E$1,listealim,6,FALSE)","v":77.400000000000006}]
[]
[]
[]
[]
[]
[]
[]
[]
[]
[]
[]
[]
[null,null,null,null,null,null,null,null,null,null,null,null,null,null,null,null,null,null,null,null,null,null,null,null,null,null,null,null,null,null,null,null,"No","Aliment","MS","NEL","NEV","PAIE","PAIN","PME","PMN","MA","MG","CB","ENA","SU","MO","CE","Ca","P","Mg","K","PF","dMO","dMA","dMG","dCB","dENA","deMA","dAA","amidon","deAM",null,"Aliment","MS","NEL","NEV","PAIE","PAIN","PME","PMN","MA","MG","CB","ENA","SU","MO","CE","Ca","P","Mg","PF","K","dMO","dMA","dMG","dCB","dENA","deMA","dAA","amidon","deAM"]
[null,null,1,2,3,4,5,6,7,8,9,10,11,12,13,14,15,16,17,18,19,20,21,22,23,24,25,26,27,28,29,30,1,2,3,4,5,6,7,8,9,10,11,12,13,14,15,16,17,18,19,20,21,22,23,24,25,26,27,28,29,30,1,2,3,4,5,6,7,8,9,10,11,12,13,14,15,16,17,18,19,20,21,22,23,24,25,26,27,28,29,30]
["No",null,"Aliment","MS","NEL","NEV","PAIE","PAIN","PME","PMN","MA","MG","CB","ENA","SU","MO","CE","Ca","P","Mg","K","PF","dMO","dMA","dMG","dCB","dENA","deMA","dAA","amidon","deAM",null,"No","Aliment","MS","NEL","NEV","PAIE","PAIN","PME","PMN","MA","MG","CB","ENA","SU","MO","CE","Ca","P","Mg","K","PF","dMO","dMA","dMG","dCB","dENA","deMA","dAA","amidon","deAM","Fut","Futtermittel","TS","NEL","NEV","APD","APDN","PME","PMN","RP","RL","RF","NfE","Zu","OS","RA","Ca","P","Mg","K","FP","vOS","vRP","vRL","vRF","vNfE","aRP","vASF","ST","aST"]
[{"$f":"IF($H$42=1,AG101,BK101)","v":1},null,{"$f":"IF($H$42=1,AH101,BL101)","v":"Agrumes, pulpe séchée "},{"$f":"IF($H$42=1,AI101,BM101)","v":1000},{"$f":"IF($H$42=1,AJ101,BN101)","v":7.55},{"$f":"IF($H$42=1,AK101,BO101)","v":8.23},{"$f":"IF($H$42=1,AL101,BP101)","v":90.9},{"$f":"IF($H$42=1,AM101,BQ101)","v":47.7},{"$f":"IF($H$42=1,AN101,BR101)","v":106.9},{"$f":"IF($H$42=1,AO101,BS101)","v":44},{"$f":"IF($H$42=1,AP101,BT101)","v":72},{"$f":"IF($H$42=1,AQ101,BU101)","v":34},{"$f":"IF($H$42=1,AR101,BV101)","v":140},{"$f":"IF($H$42=1,AS101,BW101)","v":691},{"$f":"IF($H$42=1,AT101,BX101)","v":241},{"$f":"IF($H$42=1,AU101,BY101)","v":937},{"$f":"IF($H$42=1,AV101,BZ101)","v":63},{"$f":"IF($H$42=1,AW101,CA101)","v":18.899999999999999},{"$f":"IF($H$42=1,AX101,CB101)","v":1.3},{"$f":"IF($H$42=1,AY101,CC101)","v":1.5},{"$f":"IF($H$42=1,BA101,CD101)","v":0},{"$f":"IF($H$42=1,BA101,CE101)","v":0},85,50,80,80,90,65,80,69.099999999999994,0,null,1,"Agrumes, pulpe séchée ",1000,7.55,8.23,90.9,47.7,106.9,44,72,34,140,691,241,937,63,18.899999999999999,1.3,1.5,9,null,85,50,80,80,90,65,80,69.099999999999994,0,59,"Ackerbohne, Samen",1000,7.29,7.73,126,191.7,104.2,230.3,296,17.8,94.8,550.29999999999995,41,958.9,41.1,1,6.9,1.8,13,0,83,75,70,60,91,80,90,420.7,75]
[2,null,"Amidon de céréales ",1000,8.8000000000000007,10,69,13,99,13,19,1,4,968,0,992,8,0.3,1.4,0.2,0,{"$f":"IF($H$42=1,BA102,CE102)","v":0},{"$f":"IF($H$42=1,BB102,CF102)","v":94},{"$f":"IF($H$42=1,BC102,CG102)","v":60},{"$f":"IF($H$42=1,BD102,CH102)","v":60},{"$f":"IF($H$42=1,BE102,CI102)","v":30},{"$f":"IF($H$42=1,BF102,CJ102)","v":95},{"$f":"IF($H$42=1,BG102,CK102)","v":70},{"$f":"IF($H$42=1,BH102,CL102)","v":90},{"$f":"IF($H$42=1,BI102,CM102)","v":967},{"$f":"IF($H$42=1,BJ102,CN102)","v":75},null,2,"Amidon de céréales ",1000,8.8000000000000007,10,69,13,99,13,19,1,4,968,0,992,8,0.3,1.4,0.2,1,null,94,60,60,30,95,70,90,967,75,117,"Apfel frisch",1000,8.11,9,82.7,13.4,124.2,17.899999999999999,23,19,104,832,554,978,22,0.6,0.7,0.5,9,0,90,60,30,65,95,80,60,0,0]
[3,null,"Arachide, tourteau de pression",1000,8.65,9.25,196.4,373.1,88.3,405.1,552.29999999999995,78,65.7,257.2,0,953.2,46.8,0,0,0,0,0,86,90,90,40,90,76,95,0,0,null,3,"Arachide, tourteau de pression",1000,8.65,9.25,196.4,373.1,88.3,405.1,552.29999999999995,78,65.7,257.2,null,953.2,46.8,null,null,null,null,null,86,90,90,40,90,76,95,0,0,92,"Apfeltrester getrocknet, entpektinisiert",1000,4.41,4.09,57.3,23.3,61.1,9.1,81.3,37.1,317.5,499.6,160,935.5,64.5,13.1,1.2,0.3,1,0,56,40,39,49,65,20,25,0,0]
[4,null,"Arachide, tourteau de pression, décortiquée",1000,8.5,9.1,194,366,88,398,542,77,70,255,73,944,56,1.5,6.6,3.6,0,0,86,90,90,40,90,76,95,42.2,0,null,4,"Arachide, tourteau de pression, décortiquée",1000,8.5,9.1,194,366,88,398,542,77,70,255,73,944,56,1.5,6.6,3.6,14,null,86,90,90,40,90,76,95,42.2,0,93,"Apfeltrester getrocknet, nicht entpektinisiert",1000,5.69,5.72,65.599999999999994,14.2,85.2,5.5,49.5,22.3,199.2,713.1,218,984.1,15.9,1.3,1.4,0.6,6,0,66,40,39,49,75,20,25,0,0]
[5,null,"Arachide, tourteau d'extraction, décortiquée",1000,7.6,8,205,388,92,422,575,22,74,270,107,941,59,1.5,7.2,3.7,0,0,86,90,80,40,90,76,95,88.5,0,null,5,"Arachide, tourteau d'extraction, décortiquée",1000,7.6,8,205,388,92,422,575,22,74,270,107,941,59,1.5,7.2,3.7,13,null,86,90,80,40,90,76,95,88.5,0,22,"Auswuchsweizen",1000,7.61,8.27,100.1,93.2,111,111.7,147.69999999999999,16.600000000000001,22.3,795.2,32,981.8,18.2,0.5,4.4000000000000004,1.2,3,0,83,72,76,35,87,78,80,664.3,94]
[6,null,"Avoine floconnée non décortiquée",1000,7.03,7.42,85.3,83.6,92.8,100.4,129,54.1,101.7,687.9,0,972.7,27.3,0,0,0,0,0,74,78,81,31,80,80,90,0,0,null,6,"Avoine floconnée non décortiquée",1000,7.03,7.42,85.3,83.6,92.8,100.4,129,54.1,101.7,687.9,null,972.7,27.3,null,null,null,null,null,74,78,81,31,80,80,90,0,0,32,"Backabfälle (Brotabfälle)",1000,8.4,9.4,114,98,115,100,150,26,9,784,58,969,31,0.4,2.2999999999999998,1,4,0,90,85,82,47,92,70,80,594.1,94]
[7,null,"Avoine floconnée partiellement décortiquée",1000,8.27,9.15,98.5,81.7,114.2,98.1,126.2,27,38.799999999999997,786.5,0,978.5,21.5,0,0,0,0,0,85.9,78,81,50,92,80,90,0,0,null,7,"Avoine floconnée partiellement décortiquée",1000,8.27,9.15,98.5,81.7,114.2,98.1,126.2,27,38.799999999999997,786.5,null,978.5,21.5,null,null,null,null,null,85.9,78,81,50,92,80,90,0,0,51,"Baumwollextraktionsschrot, nicht entschält",1000,5.19,4.9800000000000004,158,212,67.5,169,304,13,262,359,51,938,62,1.9,10.7,4.9000000000000004,14,0,64,74,65,45,70,60,85,0,0]
[8,null,"Avoine, farine de déchets (issues)",1000,3.93,3.49,53.6,55.9,60,70.7,90.9,30.4,217.3,625,12,963.6,36.4,1.6,4,1.1000000000000001,0,0,48,40,78,48,47,80,75,0,0,null,8,"Avoine, farine de déchets (issues)",1000,3.93,3.49,53.6,55.9,60,70.7,90.9,30.4,217.3,625,12,963.6,36.4,1.6,4,1.1000000000000001,5,null,48,40,78,48,47,80,75,0,0,52,"Baumwollextraktionsschrot, teilentschält",1000,6.25,6.29,214.5,311,71.900000000000006,248,446,16,148,323,54,933,67,2.2999999999999998,12,5.4,15,0,74,84,65,37,78,60,85,0,0]
[9,null,"Avoine, farine fourragère ",1000,7.7,8.1999999999999993,89,95,93,114,146,76,71,677,19,970,30,1,5.4,1.7,0,0,77,79,91,36,79,80,90,551.29999999999995,93,null,9,"Avoine, farine fourragère ",1000,7.7,8.1999999999999993,89,95,93,114,146,76,71,677,19,970,30,1,5.4,1.7,5,null,77,79,91,36,79,80,90,551.29999999999995,93,50,"Baumwollsamen, ganz {Baumwollsaat)",1000,7.98,8.25,85.1,151.9,47,168.3,233,220,232,271,40,956,44,1.7,6.9,3.9,12,0,63,74,90,30,60,75,85,0,0]
[10,null,"Avoine, flocons ",1000,9.39,10.56,101.2,94.7,115.9,117.8,151.4,70.5,14.2,742.3,18,978.4,21.6,0.9,5,1.4,0,0,92,80,90,80,95,80,80,656,75,null,10,"Avoine, flocons ",1000,9.39,10.56,101.2,94.7,115.9,117.8,151.4,70.5,14.2,742.3,18,978.4,21.6,0.9,5,1.4,4,null,92,80,90,80,95,80,80,656,75,70,"Bierhefe getrocknet",1000,7.35,7.74,143.1,304.2,94.6,385.1,495,28.1,2,402.7,23,927.8,72.2,2.6,15,2.2000000000000002,24,0,84,82,61,50,88,80,75,0,0]
[11,null,"Avoine, grain",1000,6.73,7.02,81.900000000000006,77.400000000000006,90.6,92.9,119.4,50.4,118.8,682,0,970.6,29.4,0,0,0,0,0,72,78,81,31,78,80,90,461.8,93,null,11,"Avoine, grain",1000,6.73,7.02,81.900000000000006,77.400000000000006,90.6,92.9,119.4,50.4,118.8,682,null,970.6,29.4,null,null,null,null,null,72,78,81,31,78,80,90,461.8,93,55,"Biertreber frisch ",1000,6.41,6.45,130.69999999999999,176.8,58.9,145.5,261.8,87.1,164.6,444.7,13,958.2,41.8,3.8,6.7,2.5,1,0,64,74,90,44,62,60,80,36.5,0]
[12,null,"Avoine, grain décortiqué",1000,8.23,9.01,88.3,87.1,95.8,104.6,134.5,54.3,89.2,695.6,0,973.6,26.4,0,0,0,0,0,76.2,78,81,50,92,80,90,540.79999999999995,93,null,12,"Avoine, grain décortiqué",1000,8.23,9.01,88.3,87.1,95.8,104.6,134.5,54.3,89.2,695.6,null,973.6,26.4,null,null,null,null,null,76.2,78,81,50,92,80,90,540.79999999999995,93,56,"Biertreber getrocknet ",1000,6.57,6.64,148.69999999999999,178.8,55.1,113.7,255.4,104,162.19999999999999,433.7,10,955.3,44.7,3.2,5.3,1.6,1,0,64,74,90,44,60,50,80,36.5,0]
[13,null,"Avoine, grain, léger (42-49 kg/hl)",1000,6.6,6.9,82,72,93,86,111,42,123,693,16,969,31,0.9,4.0999999999999996,1.2,0,0,{"$f":"IF($H$42=1,BB113,CF113)","v":72},{"$f":"IF($H$42=1,BC113,CG113)","v":78},{"$f":"IF($H$42=1,BD113,CH113)","v":81},{"$f":"IF($H$42=1,BE113,CI113)","v":31},{"$f":"IF($H$42=1,BF113,CJ113)","v":78},{"$f":"IF($H$42=1,BG113,CK113)","v":80},{"$f":"IF($H$42=1,BH113,CL113)","v":90},{"$f":"IF($H$42=1,BI113,CM113)","v":461.8},{"$f":"IF($H$42=1,BJ113,CN113)","v":93},null,13,"Avoine, grain, léger (42-49 kg/hl)",1000,6.6,6.9,82,72,93,86,111,42,123,693,16,969,31,0.9,4.0999999999999996,1.2,5,null,72,78,81,31,78,80,90,461.8,93,54,"Biertreber siliert ",1000,6.35,6.36,114.7,166.5,57.1,153.6,251.2,97.1,178.3,433.4,38,960,40,3.5,6,2.2999999999999998,1,50,62,74,90,44,58,65,80,26,0]
[14,null,"Avoine, grain, moyen à lourd (50-57 kg/hl)",1000,6.9,7.2,84,73,96,87,112,47,109,701,17,969,31,0.9,4.0999999999999996,1.2,0,0,74,78,81,31,80,80,90,461.8,93,null,14,"Avoine, grain, moyen à lourd (50-57 kg/hl)",1000,6.9,7.2,84,73,96,87,112,47,109,701,17,969,31,0.9,4.0999999999999996,1.2,5,null,74,78,81,31,80,80,90,461.8,93,111,"Birne frisch",1000,7.95,8.7899999999999991,82.1,11,124.1,14.8,19,11,151,797,529,978,22,0.7,0.6,0.5,5,0,89,60,30,65,95,80,60,0,0]
[15,null,"Babeurre frais ",1000,8.4499999999999993,9.36,99.9,189.8,107.4,275.7,310.2,60.1,0,533.79999999999995,469,904.1,96,11,9.6999999999999993,1.1000000000000001,0,0,92,90,90,0,94,90,90,0,0,null,15,"Babeurre frais ",1000,8.4499999999999993,9.36,99.9,189.8,107.4,275.7,310.2,60.1,0,533.79999999999995,469,904.1,96,11,9.6999999999999993,1.1000000000000001,17,null,92,90,90,0,94,90,90,0,0,91,"Birnentrester getrocknet",1000,4.16,3.75,54,12.7,68.8,5,44.6,13.5,372.3,558.20000000000005,188,988.6,11.4,1,0.9,0.3,4,0,53,40,39,35,65,20,25,0,0]
[16,null,"Babeurre, poudre ",1000,8.4499999999999993,9.36,99.9,189.8,107.4,275.7,310.2,60.1,0,533.79999999999995,421,887,113,11,9.5,1,0,0,92,90,90,0,94,90,90,0,0,null,16,"Babeurre, poudre ",1000,8.4499999999999993,9.36,99.9,189.8,107.4,275.7,310.2,60.1,0,533.79999999999995,421,887,113,11,9.5,1,17,null,92,90,90,0,94,90,90,0,0,132,"Blutmehl",1000,7.64,7.79,643.6,725.8,14.5,159.5,952.5,6.5,2.7,3.7,0,965.4,34.6,1.7,1.7,0.3,3,0,85,85,90,0,50,25,80,0,0]
[17,null,"Betterave fourragère, fraîche",1000,7.65,8.49,84.9,40.700000000000003,117.8,54.5,70,3.7,47,812.3,596,933,67,2.1,2.2000000000000002,1.3,0,0,89,55,40,75,93,80,60,0,0,null,17,"Betterave fourragère, fraîche",1000,7.65,8.49,84.9,40.700000000000003,117.8,54.5,70,3.7,47,812.3,596,933,67,2.1,2.2000000000000002,1.3,18,null,89,55,40,75,93,80,60,0,0,60,"Bohne, Samen, getoastet",1000,7.7,8.35,147.5,173.8,105.2,162.9,257,17,53,624,53,951,49,1.6,5.3,1.8,15,0,87,85,70,60,90,67,85,403.6,75]
[18,null,"Betterave sucrière, fraîche ",1000,7.71,8.58,84.4,33.1,119.8,44.3,57,2,47,827,676,933,67,2.1,1.5,1.3,0,0,90,55,30,75,93,80,60,0,0,null,18,"Betterave sucrière, fraîche ",1000,7.71,8.58,84.4,33.1,119.8,44.3,57,2,47,827,676,933,67,2.1,1.5,1.3,9,null,90,55,30,75,93,80,60,0,0,129,"Bruchreis",1000,8.56,9.6,89.7,60.5,84.9,44.1,88,9.9,3.2,890.9,48,992,8,0.1,1.4,0.4,1,0,92,71,67,30,94,55,80,840.5,75]
[19,null,"Betteraves, pulpe, ensilée",1000,7.17,7.71,105.6,66.3,106.2,50.1,100.1,10,211.8,621.1,18,943,57,7.5,1.2,2.6,95,95,85,60,30,80,92,55,75,0,0,null,19,"Betteraves, pulpe, ensilée",1000,7.17,7.71,105.6,66.3,106.2,50.1,100.1,10,211.8,621.1,18,943,57,7.5,1.2,2.6,7,95,85,60,30,80,92,55,75,0,0,15,"Buttermilch frisch",1000,8.4499999999999993,9.36,99.9,189.8,107.4,275.7,310.2,60.1,0,533.79999999999995,469,904.1,96,11,9.6999999999999993,1.1000000000000001,17,0,92,90,90,0,94,90,90,0,0]
[20,null,"Betteraves, pulpe, séchée",1000,7.24,7.82,109.8,63.2,108.7,40.200000000000003,90.2,8.5,206,640.5,66,945.2,54.8,7.8,1,2.1,0,0,85,60,30,80,92,50,80,0,0,null,20,"Betteraves, pulpe, séchée",1000,7.24,7.82,109.8,63.2,108.7,40.200000000000003,90.2,8.5,206,640.5,66,945.2,54.8,7.8,1,2.1,7,null,85,60,30,80,92,50,80,0,0,16,"Buttermilchpulver",1000,8.4499999999999993,9.36,99.9,189.8,107.4,275.7,310.2,60.1,0,533.79999999999995,421,887,113,11,9.5,1,17,0,92,90,90,0,94,90,90,0,0]
[21,null,"Blé fourrager, grain",1000,8.57,9.57,114,91.8,122.5,98,135.6,15.7,21.1,810.7,0,983.1,17,0,0,0,0,0,91,78,83,51,95,75,94,677.2,94,null,21,"Blé fourrager, grain",1000,8.57,9.57,114,91.8,122.5,98,135.6,15.7,21.1,810.7,null,983.1,17,null,null,null,null,null,91,78,83,51,95,75,94,677.2,94,122,"Ca-Kaseinpulver",1000,8.83,9.35,168.5,577.20000000000005,115.8,838.6,943.3,14.3,0,0,0,955,45.1,0,0,0,0,0,95,95,90,0,95,90,90,0,0]
[22,null,"Blé germé, grain ",1000,7.61,8.27,100.1,93.2,111,111.7,147.69999999999999,16.600000000000001,22.3,795.2,32,981.8,18.2,0.5,4.4000000000000004,1.2,0,0,83,72,76,35,87,78,80,664.3,94,null,22,"Blé germé, grain ",1000,7.61,8.27,100.1,93.2,111,111.7,147.69999999999999,16.600000000000001,22.3,795.2,32,981.8,18.2,0.5,4.4000000000000004,1.2,3,null,83,72,76,35,87,78,80,664.3,94,58,"Dinkel, Körner",1000,6.39,6.62,87.4,86.9,90.8,100.3,136.69999999999999,19.8,142.1,671.5,30,970.1,29.9,0.7,4.3,1.1000000000000001,4,0,73,76,80,46,78,76,80,479.6,94]
[23,null,"Blé grain expandé",1000,8.5,9.4600000000000009,132.30000000000001,111.3,117.9,94.9,155.19999999999999,19.5,20.5,779.4,0,974.6,25.4,0,0,0,0,0,91,78,83,51,95,65,94,651.1,94,null,23,"Blé grain expandé",1000,8.5,9.4600000000000009,132.30000000000001,111.3,117.9,94.9,155.19999999999999,19.5,20.5,779.4,null,974.6,25.4,null,null,null,null,null,91,78,83,51,95,65,94,651.1,94,5,"Erdnuss-Extraktionsschrot a. entschälter Saat",1000,7.6,8,205,388,92,422,575,22,74,270,107,941,59,1.5,7.2,3.7,13,0,86,90,80,40,90,76,95,88.5,0]
[24,null,"Blé, amidon de ",1000,8.7799999999999994,9.9600000000000009,73.2,18.100000000000001,101.7,17.600000000000001,26.4,4.2,4.5999999999999996,958,0,993.2,6.8,0,0,0,0,0,94,60,60,30,95,70,90,879.1,75,null,24,"Blé, amidon de ",1000,8.7799999999999994,9.9600000000000009,73.2,18.100000000000001,101.7,17.600000000000001,26.4,4.2,4.5999999999999996,958,null,993.2,6.8,null,null,null,null,null,94,60,60,30,95,70,90,879.1,75,3,"Erdnusskuchen",1000,8.65,9.25,196.4,373.1,88.3,405.1,552.29999999999995,78,65.7,257.2,0,953.2,46.8,0,0,0,0,0,86,90,90,40,90,76,95,0,0]
[25,null,"Blé, farine fourragère 1re (claire)",1000,8.8800000000000008,9.92,114.8,118.9,121.5,142.5,188.5,30.6,12.9,746.8,74,978.8,21.2,0.5,4.5,1.4,0,0,93,85,82,47,96,78,80,565.79999999999995,94,null,25,"Blé, farine fourragère 1re (claire)",1000,8.8800000000000008,9.92,114.8,118.9,121.5,142.5,188.5,30.6,12.9,746.8,74,978.8,21.2,0.5,4.5,1.4,4,null,93,85,82,47,96,78,80,565.79999999999995,94,4,"Erdnusskuchen entschälter Saat",1000,8.5,9.1,194,366,88,398,542,77,70,255,73,944,56,1.5,6.6,3.6,14,0,86,90,90,40,90,76,95,42.2,0]
[26,null,"Blé, farine fourragère 2e (foncée)",1000,7.69,8.2899999999999991,101.4,117.4,101.3,140.80000000000001,186.2,50.6,46.7,680.5,64,964,36,1.2,8.8000000000000007,2.9,0,0,82,81,75,33,86,78,80,440,94,null,26,"Blé, farine fourragère 2e (foncée)",1000,7.69,8.2899999999999991,101.4,117.4,101.3,140.80000000000001,186.2,50.6,46.7,680.5,64,964,36,1.2,8.8000000000000007,2.9,9,null,82,81,75,33,86,78,80,440,94,110,"Federmehl aufgeschlossen",1000,8.4,8.6999999999999993,494,595,19,197,885,67,9,13,0,974,26,5.2,3.6,0.4,1,0,84,86,84,0,0,30,70,0,0]
[27,null,"Blé, germe ",1000,9.4,10.42,122.9,197.9,100.3,241.9,320,101,25.9,501.5,128,948.4,51.6,0.8,12.4,3.1,0,0,91,90,90,40,94,78,75,245,94,null,27,"Blé, germe ",1000,9.4,10.42,122.9,197.9,100.3,241.9,320,101,25.9,501.5,128,948.4,51.6,0.8,12.4,3.1,11,null,91,90,90,40,94,78,75,245,94,113,"Fischmehl 64 % RP",1000,7.83,8.2899999999999991,418.1,541.1,28.6,245.8,690,103,5,7,0,805,195,47.9,28.1,2.5,11,0,87,88,86,30,50,42,90,0,0]
[28,null,"Blé, gluten ",1000,9.36,10.039999999999999,256.89999999999998,549.1,102.7,621.79999999999995,860.6,26.9,3.9,98.3,4,989.7,10.3,1,2.2000000000000002,0.5,0,0,96,96,90,40,97,75,80,61.8,0,null,28,"Blé, gluten ",1000,9.36,10.039999999999999,256.89999999999998,549.1,102.7,621.79999999999995,860.6,26.9,3.9,98.3,4,989.7,10.3,1,2.2000000000000002,0.5,1,null,96,96,90,40,97,75,80,61.8,0,114,"Fischmehl 70/72 % RP Heringtyp",1000,8.49,9,463.5,601.29999999999995,30.1,273.10000000000002,766.7,108.6,2.7,0,0,864.6,135.4,26.6,22.9,2,11,0,88,88,86,30,50,42,90,0,0]
[29,null,"Blé, grain ",1000,8.5,9.4600000000000009,118.5,105.4,121.4,112.5,155.69999999999999,16.3,23.3,785.7,32,981,19.100000000000001,0.5,4.4000000000000004,1.2,0,0,91,78,83,51,95,75,94,656.3,94,null,29,"Blé, grain ",1000,8.5,9.4600000000000009,118.5,105.4,121.4,112.5,155.69999999999999,16.3,23.3,785.7,32,981,19.100000000000001,0.5,4.4000000000000004,1.2,4,null,91,78,83,51,95,75,94,656.3,94,157,"Fleischknochenmehl 40 % RP",1000,5.0999999999999996,5.3,148,278,26,254,457,84,9,12,0,562,438,149.80000000000001,73.099999999999994,2.2999999999999998,8,0,79,80,86,30,40,60,65,0,0]
[30,null,"Blé, remoulage ",1000,7.35,7.84,100.4,122.1,97.6,146.30000000000001,193.6,45.8,56.3,668.1,65,963.8,36.299999999999997,1.2,8.5,2.8,0,0,79,81,75,33,83,78,80,390.7,94,null,30,"Blé, remoulage ",1000,7.35,7.84,100.4,122.1,97.6,146.30000000000001,193.6,45.8,56.3,668.1,65,963.8,36.299999999999997,1.2,8.5,2.8,7,null,79,81,75,33,83,78,80,390.7,94,156,"Fleischmehl 60% RP",1000,7.4,7.7,216,391,47,358,643,89,29,32,0,793,207,61.7,32.200000000000003,1.6,6,0,85,89,86,30,50,60,65,0,0]
[31,null,"Blé, son ",1000,6.14,6.29,99.9,116.3,81.400000000000006,119.3,178.8,45.4,114.2,591.9,66,930.3,69.7,1.5,14,4.7,0,0,71,78,69,31,76,70,80,156,0,null,31,"Blé, son ",1000,6.14,6.29,99.9,116.3,81.400000000000006,119.3,178.8,45.4,114.2,591.9,66,930.3,69.7,1.5,14,4.7,13,null,71,78,69,31,76,70,80,156,0,71,"Futterhefe",1000,7.38,7.73,145.69999999999999,327,89,414.1,532.20000000000005,41.2,7.4,347.5,3,928.3,71.7,7.3,15.6,1.2,13,0,82,82,61,50,88,80,75,52,0]
[32,null,"Boulangerie, déchets ",1000,8.4,9.4,114,98,115,100,150,26,9,784,58,969,31,0.4,2.2999999999999998,1,0,0,90,85,82,47,92,70,80,594.1,94,null,32,"Boulangerie, déchets ",1000,8.4,9.4,114,98,115,100,150,26,9,784,58,969,31,0.4,2.2999999999999998,1,4,null,90,85,82,47,92,70,80,594.1,94,116,"Futterkartoffel, Knolle frisch",1000,7.57,8.3800000000000008,74.900000000000006,56.9,91.5,70.8,91,3,23,812,37,929,71,1,2.5,1,22,0,89,55,30,70,93,80,80,697,75]
[{"$f":"IF($H$42=1,AG133,BK133)","v":33},null,{"$f":"IF($H$42=1,AH133,BL133)","v":"Cacao, pelures "},{"$f":"IF($H$42=1,AI133,BM133)","v":1000},{"$f":"IF($H$42=1,AJ133,BN133)","v":2.2000000000000002},{"$f":"IF($H$42=1,AK133,BO133)","v":1.6},{"$f":"IF($H$42=1,AL133,BP133)","v":29},{"$f":"IF($H$42=1,AM133,BQ133)","v":72},{"$f":"IF($H$42=1,AN133,BR133)","v":20},{"$f":"IF($H$42=1,AO133,BS133)","v":98},{"$f":"IF($H$42=1,AP133,BT133)","v":177},{"$f":"IF($H$42=1,AQ133,BU133)","v":51},{"$f":"IF($H$42=1,AR133,BV133)","v":183},{"$f":"IF($H$42=1,AS133,BW133)","v":502},{"$f":"IF($H$42=1,AT133,BX133)","v":36},{"$f":"IF($H$42=1,AU133,BY133)","v":913},{"$f":"IF($H$42=1,AV133,BZ133)","v":87},{"$f":"IF($H$42=1,AW133,CA133)","v":3.4},{"$f":"IF($H$42=1,AX133,CB133)","v":4.2},{"$f":"IF($H$42=1,AY133,CC133)","v":5.2},{"$f":"IF($H$42=1,BA133,CD133)","v":0},0,29,15,50,32,30,60,20,89,0,null,33,"Cacao, pelures ",1000,2.2000000000000002,1.6,29,72,20,98,177,51,183,502,36,913,87,3.4,4.2,5.2,30,null,29,15,50,32,30,60,20,89,0,124,"Futterprotein Protorsan 70% RP",1000,8.75,9.26,124.6,433.1,105.2,652.9,734.4,75.599999999999994,11.7,139.5,5,961.2,38.799999999999997,2.7,14,2.1,3,0,91,94,61,50,88,90,70,0,0]
[34,null,"Café, marc ",1000,2.1800000000000002,1.33,19.2,35.1,0,27.6,123.7,211.2,459.4,191.4,14,985.7,14.3,1.9,0.6,0.7,0,{"$f":"IF($H$42=1,BA134,CE134)","v":0},18,9,40,7,21,30,20,0,0,null,34,"Café, marc ",1000,2.1800000000000002,1.33,19.2,35.1,0,27.6,123.7,211.2,459.4,191.4,14,985.7,14.3,1.9,0.6,0.7,2,null,18,9,40,7,21,30,20,0,0,17,"Futterrübe",1000,7.65,8.49,84.9,40.700000000000003,117.8,54.5,70,3.7,47,812.3,596,933,67,2.1,2.2000000000000002,1.3,18,0,89,55,40,75,93,80,60,0,0]
[35,null,"Carotte rouge ",1000,6.96,7.54,82,81.8,104.3,115.9,139,17,73,662,110,891,109,2.7,2.7,2.1,0,0,85,65,64,79,90,85,65,0,0,null,35,"Carotte rouge ",1000,6.96,7.54,82,81.8,104.3,115.9,139,17,73,662,110,891,109,2.7,2.7,2.1,33,null,85,65,64,79,90,85,65,0,0,21,"Futterweizen, Körner",1000,8.57,9.57,114,91.8,122.5,98,135.6,15.7,21.1,810.7,0,983.1,17,0,0,0,0,0,91,78,83,51,95,75,94,677.2,94]
[36,null,"Carotte, racine ",1000,7.5,8.2799999999999994,82.1,56.5,111.8,80,96,15,91,697,256,899,101,3,3,1.9,0,0,89,60,77,86,94,85,65,0,0,null,36,"Carotte, racine ",1000,7.5,8.2799999999999994,82.1,56.5,111.8,80,96,15,91,697,256,899,101,3,3,1.9,26,null,89,60,77,86,94,85,65,0,0,102,"Gerste, Körner leicht (55 - 61 kg/hl)",1000,7.47,8.09,99.6,79.099999999999994,108.9,85.9,118.8,24.6,59.8,767.4,26,970.6,29.4,0.6,4.5,1.2,6,0,83,73,70,35,88,75,90,593.1,89]
[37,null,"Caroube, farine de gousses",1000,6.01,6.23,82.1,45.1,96.7,43.4,68.5,10,101.1,778.3,415,957.9,42.1,5.2,1,0.6,0,0,73,16,60,47,80,67,80,0,0,null,37,"Caroube, farine de gousses",1000,6.01,6.23,82.1,45.1,96.7,43.4,68.5,10,101.1,778.3,415,957.9,42.1,5.2,1,0.6,8,null,73,16,60,47,80,67,80,0,0,104,"Gerste, Körner mittel (62 - 69 kg/hl)",1000,7.77,8.49,100.9,77.400000000000006,112,84,116.3,26.2,48.4,783.1,27,974,26,0.6,4.5,1.2,6,0,85,73,70,35,90,75,90,600.70000000000005,89]
[38,null,"Caséine, poudre ",1000,8.6999999999999993,9.1999999999999993,163,559,112,813,914,14,0,17,0,945,55,2.6,7.7,0.2,0,0,95,95,90,0,95,90,90,0,0,null,38,"Caséine, poudre ",1000,8.6999999999999993,9.1999999999999993,163,559,112,813,914,14,0,17,0,945,55,2.6,7.7,0.2,1,null,95,95,90,0,95,90,90,0,0,103,"Gerste, Körner vollkörnig (70 - 74 kg/hl)",1000,7.96,8.7200000000000006,108.3,93.6,114.1,101.5,140.5,26.4,40.5,767.6,27,975,25,0.6,4.5,1.2,6,0,87,73,70,35,92,75,90,612.9,89]
[39,null,"Choux-rave ",1000,7.26,7.94,86.9,69.900000000000006,108.9,91.8,118,12,111,663,401,904,96,5.0999999999999996,4,1.6,0,0,87,70,60,82,92,80,65,0,0,null,39,"Choux-rave ",1000,7.26,7.94,86.9,69.900000000000006,108.9,91.8,118,12,111,663,401,904,96,5.0999999999999996,4,1.6,30,null,87,70,60,82,92,80,65,0,0,101,"Gerstenflocken",1000,8.98,10.15,123.5,77.8,128.80000000000001,64,115.2,13.2,8.6,849.8,15,987,13,0.5,3,0.6,3,0,96,90,41,21,98,60,80,722.1,89]
[40,null,"Colza 00, tourteau de pression",1000,7.69,8.11,129.6,225.8,75.099999999999994,250.8,352.6,100.7,111.3,358.1,0,922.7,77.3,0,0,0,0,0,77,83,90,28,83,74,80,0,0,null,40,"Colza 00, tourteau de pression",1000,7.69,8.11,129.6,225.8,75.099999999999994,250.8,352.6,100.7,111.3,358.1,null,922.7,77.3,null,null,null,null,null,77,83,90,28,83,74,80,0,0,100,"Gerstenfuttermehl",1000,7.7,8.3699999999999992,98.5,86.2,106.7,97.4,130.80000000000001,30.3,55.9,754.1,72,971.1,28.9,0.7,5.5,1.6,7,0,82,73,70,35,90,77,90,413,89]
[41,null,"Colza 00, tourteau d'extraction 1.3 -  2.5 % MG",1000,6.41,6.56,142.1,248.9,81.599999999999994,276.39999999999998,388.6,23.8,116.4,388.1,0,916.9,83.1,0,0,0,0,0,75,83,80,24,83,74,80,0,0,null,41,"Colza 00, tourteau d'extraction 1.3 -  2.5 % MG",1000,6.41,6.56,142.1,248.9,81.599999999999994,276.39999999999998,388.6,23.8,116.4,388.1,null,916.9,83.1,null,null,null,null,null,75,83,80,24,83,74,80,0,0,105,"Gerstenschälmehl",1000,6.42,6.65,81.900000000000006,79.8,89.3,95.8,128.69999999999999,41.6,133,650.70000000000005,66,954,46,1.3,5.3,1.8,6,0,72,73,70,35,80,77,75,356.4,89]
[42,null,"Colza 00, tourteau pressé à froid",1000,8.9600000000000009,9.65,90.1,201.4,72.3,273.8,328.5,177.9,97.5,326.8,0,930.7,69.3,0,0,0,0,0,78,83,90,28,83,85,80,0,0,null,42,"Colza 00, tourteau pressé à froid",1000,8.9600000000000009,9.65,90.1,201.4,72.3,273.8,328.5,177.9,97.5,326.8,null,930.7,69.3,null,null,null,null,null,78,83,90,28,83,85,80,0,0,53,"Griebenmehl",1000,10.1,10.9,293,526,68,480,864,99,5,0,0,968,32,5,5.6,0.8,5,0,95,95,95,30,0,60,65,0,0]
[43,null,"Colza, graine ",1000,13.77,15.57,45.2,115.8,34.700000000000003,161.19999999999999,207.2,475.4,83.7,190.6,52,956.9,43.1,4.5,8.1,3.1,0,0,79,75,94,24,73,80,50,30.8,0,null,43,"Colza, graine ",1000,13.77,15.57,45.2,115.8,34.700000000000003,161.19999999999999,207.2,475.4,83.7,190.6,52,956.9,43.1,4.5,8.1,3.1,9,null,79,75,94,24,73,80,50,30.8,0,6,"Hafer flockiert nicht entspelzt",1000,7.03,7.42,85.3,83.6,92.8,100.4,129,54.1,101.7,687.9,0,972.7,27.3,0,0,0,0,0,74,78,81,31,80,80,90,0,0]
[44,null,"Colza, tourteau de presse, 4-9 % MG",1000,7.2,7.5,134,232,78,258,363,75,117,365,127,920,80,8.1,12.6,5.2,0,0,77,83,90,28,83,74,80,83,0,null,44,"Colza, tourteau de presse, 4-9 % MG",1000,7.2,7.5,134,232,78,258,363,75,117,365,127,920,80,8.1,12.6,5.2,15,null,77,83,90,28,83,74,80,83,0,7,"Hafer flockiert teilentspelzt",1000,8.27,9.15,98.5,81.7,114.2,98.1,126.2,27,38.799999999999997,786.5,0,978.5,21.5,0,0,0,0,0,85.9,78,81,50,92,80,90,0,0]
[45,null,"Colza, tourteau de pression, > 9 % MG",1000,7.7,8.1999999999999993,128,224,74,249,350,108,112,352,119,922,78,8.6,12.8,5.2,0,0,77,83,90,28,83,74,80,83,0,null,45,"Colza, tourteau de pression, > 9 % MG",1000,7.7,8.1999999999999993,128,224,74,249,350,108,112,352,119,922,78,8.6,12.8,5.2,17,null,77,83,90,28,83,74,80,83,0,11,"Hafer, Körner",1000,6.73,7.02,81.900000000000006,77.400000000000006,90.6,92.9,119.4,50.4,118.8,682,0,970.6,29.4,0,0,0,0,0,72,78,81,31,78,80,90,461.8,93]
[46,null,"Colza, tourteau de pression, filière bio-diesel",1000,8.4,9,95,196,82,267,320,140,101,368,114,929,71,8.1999999999999993,12.3,5,0,0,78,93,90,28,83,85,80,83,0,null,46,"Colza, tourteau de pression, filière bio-diesel",1000,8.4,9,95,196,82,267,320,140,101,368,114,929,71,8.1999999999999993,12.3,5,16,null,78,93,90,28,83,85,80,83,0,12,"Hafer, Körner entspelzt",1000,8.23,9.01,88.3,87.1,95.8,104.6,134.5,54.3,89.2,695.6,0,973.6,26.4,0,0,0,0,0,76.2,78,81,50,92,80,90,540.79999999999995,93]
[47,null,"Colza, tourteau d'extraction",1000,6.2,6.4,140,247,80,274,385,18,124,388,99,915,85,9.9,14,5.0999999999999996,0,0,75,83,80,24,83,74,80,70.8,0,null,47,"Colza, tourteau d'extraction",1000,6.2,6.4,140,247,80,274,385,18,124,388,99,915,85,9.9,14,5.0999999999999996,14,null,75,83,80,24,83,74,80,70.8,0,13,"Hafer, Körner leicht(42-49 kg/hl)",1000,6.6,6.9,82,72,93,86,111,42,123,693,16,969,31,0.9,4.0999999999999996,1.2,5,0,72,78,81,31,78,80,90,461.8,93]
[48,null,"Colza, tourteau d'extraction 00 > 2.5 % MG",1000,6.5,6.68,135.4,234.7,79.2,260.7,366.5,38.200000000000003,115.8,385.8,0,906.3,93.7,0,0,0,0,0,75,83,80,24,83,74,80,0,0,null,48,"Colza, tourteau d'extraction 00 > 2.5 % MG",1000,6.5,6.68,135.4,234.7,79.2,260.7,366.5,38.200000000000003,115.8,385.8,null,906.3,93.7,null,null,null,null,null,75,83,80,24,83,74,80,0,0,14,"Hafer, mittel bisvollkörnig (50-57 kg/hl)",1000,6.9,7.2,84,73,96,87,112,47,109,701,17,969,31,0.9,4.0999999999999996,1.2,5,0,74,78,81,31,80,80,90,461.8,93]
[49,null,"Coprah, tourteau d'extraction",1000,6.79,7.13,186.2,184.9,82.7,90.1,238,27,161,499,125,925,75,1.8,6.5,3.9,0,0,79,80,80,60,85,44,90,0,0,null,49,"Coprah, tourteau d'extraction",1000,6.79,7.13,186.2,184.9,82.7,90.1,238,27,161,499,125,925,75,1.8,6.5,3.9,18,null,79,80,80,60,85,44,90,0,0,8,"Haferabfallmehl",1000,3.93,3.49,53.6,55.9,60,70.7,90.9,30.4,217.3,625,12,963.6,36.4,1.6,4,1.1000000000000001,5,0,48,40,78,48,47,80,75,0,0]
[50,null,"Coton, graine ",1000,7.98,8.25,85.1,151.9,47,168.3,233,220,232,271,40,956,44,1.7,6.9,3.9,0,0,63,74,90,30,60,75,85,0,0,null,50,"Coton, graine ",1000,7.98,8.25,85.1,151.9,47,168.3,233,220,232,271,40,956,44,1.7,6.9,3.9,12,null,63,74,90,30,60,75,85,0,0,10,"Haferflocken",1000,9.39,10.56,101.2,94.7,115.9,117.8,151.4,70.5,14.2,742.3,18,978.4,21.6,0.9,5,1.4,4,0,92,80,90,80,95,80,80,656,75]
[51,null,"Coton, tourteau d'extraction, non décortiqué",1000,5.19,4.9800000000000004,158,212,67.5,169,304,13,262,359,51,938,62,1.9,10.7,4.9000000000000004,0,0,64,74,65,45,70,60,85,0,0,null,51,"Coton, tourteau d'extraction, non décortiqué",1000,5.19,4.9800000000000004,158,212,67.5,169,304,13,262,359,51,938,62,1.9,10.7,4.9000000000000004,14,null,64,74,65,45,70,60,85,0,0,9,"Haferfuttermehl",1000,7.7,8.1999999999999993,89,95,93,114,146,76,71,677,19,970,30,1,5.4,1.7,5,0,77,79,91,36,79,80,90,551.29999999999995,93]
[52,null,"Coton, tourteau d'extraction, partiel. décortiqué",1000,6.25,6.29,214.5,311,71.900000000000006,248,446,16,148,323,54,933,67,2.2999999999999998,12,5.4,0,0,74,84,65,37,78,60,85,0,0,null,52,"Coton, tourteau d'extraction, partiel. décortiqué",1000,6.25,6.29,214.5,311,71.900000000000006,248,446,16,148,323,54,933,67,2.2999999999999998,12,5.4,15,null,74,84,65,37,78,60,85,0,0,64,"Hartkäsemolke",1000,7.9,8.8800000000000008,102.6,83.5,119.8,100.3,128.9,7.2,0,777.6,709,913.7,86.3,5.8,6.1,1.1000000000000001,23,0,94,90,90,0,95,80,90,0,0]
[53,null,"Cretons, farine ",1000,10.1,10.9,293,526,68,480,864,99,5,0,0,968,32,5,5.6,0.8,0,0,95,95,95,30,0,60,65,0,0,null,53,"Cretons, farine ",1000,10.1,10.9,293,526,68,480,864,99,5,0,0,968,32,5,5.6,0.8,5,null,95,95,95,30,0,60,65,0,0,98,"Hirse, Körner 4-6% RF",1000,7.6,8.1999999999999993,106,81,79,44,113,37,63,760,9,973,27,0.4,3.5,1.4,4,0,82,53,81,24,91,45,80,619.6,75]
[54,null,"Drêches de brasserie, ensilées",1000,6.35,6.36,114.7,166.5,57.1,153.6,251.2,97.1,178.3,433.4,38,960,40,3.5,6,2.2999999999999998,50,50,62,74,90,44,58,65,80,26,0,null,54,"Drêches de brasserie, ensilées",1000,6.35,6.36,114.7,166.5,57.1,153.6,251.2,97.1,178.3,433.4,38,960,40,3.5,6,2.2999999999999998,1,50,62,74,90,44,58,65,80,26,0,96,"Hirse, Körner unter 4% RF(Milocorn/Sorghum)",1000,8,8.8000000000000007,102,73,81,40,102,29,23,828,11,982,18,0.4,3.5,1.4,4,0,85,53,81,24,91,45,80,730,75]
[55,null,"Drêches de brasserie, fraîches",1000,6.41,6.45,130.69999999999999,176.8,58.9,145.5,261.8,87.1,164.6,444.7,13,958.2,41.8,3.8,6.7,2.5,0,0,64,74,90,44,62,60,80,36.5,0,null,55,"Drêches de brasserie, fraîches",1000,6.41,6.45,130.69999999999999,176.8,58.9,145.5,261.8,87.1,164.6,444.7,13,958.2,41.8,3.8,6.7,2.5,1,null,64,74,90,44,62,60,80,36.5,0,37,"Johannisbrot",1000,6.01,6.23,82.1,45.1,96.7,43.4,68.5,10,101.1,778.3,415,957.9,42.1,5.2,1,0.6,8,0,73,16,60,47,80,67,80,0,0]
[56,null,"Drêches de brasserie, séchées",1000,6.57,6.64,148.69999999999999,178.8,55.1,113.7,255.4,104,162.19999999999999,433.7,10,955.3,44.7,3.2,5.3,1.6,0,0,64,74,90,44,60,50,80,36.5,0,null,56,"Drêches de brasserie, séchées",1000,6.57,6.64,148.69999999999999,178.8,55.1,113.7,255.4,104,162.19999999999999,433.7,10,955.3,44.7,3.2,5.3,1.6,1,null,64,74,90,44,60,50,80,36.5,0,34,"Kaffeeextraktionsabfälle",1000,2.1800000000000002,1.33,19.2,35.1,0,27.6,123.7,211.2,459.4,191.4,14,985.7,14.3,1.9,0.6,0.7,2,0,18,9,40,7,21,30,20,0,0]
[57,null,"Endive, racine ",1000,7.16,7.81,78.8,51.8,108,73.3,88,18,108,688,131,902,98,5,2.6,1.3,0,0,86,71,60,77,90,85,65,0,0,null,57,"Endive, racine ",1000,7.16,7.81,78.8,51.8,108,73.3,88,18,108,688,131,902,98,5,2.6,1.3,20,null,86,71,60,77,90,85,65,0,0,33,"Kakaoschalen",1000,2.2000000000000002,1.6,29,72,20,98,177,51,183,502,36,913,87,3.4,4.2,5.2,30,0,29,15,50,32,30,60,20,89,0]
[58,null,"Epeautre, grain ",1000,6.39,6.62,87.4,86.9,90.8,100.3,136.69999999999999,19.8,142.1,671.5,30,970.1,29.9,0.7,4.3,1.1000000000000001,0,0,73,76,80,46,78,76,80,479.6,94,null,58,"Epeautre, grain ",1000,6.39,6.62,87.4,86.9,90.8,100.3,136.69999999999999,19.8,142.1,671.5,30,970.1,29.9,0.7,4.3,1.1000000000000001,4,null,73,76,80,46,78,76,80,479.6,94,36,"Karotte, Wurzel frisch",1000,7.5,8.2799999999999994,82.1,56.5,111.8,80,96,15,91,697,256,899,101,3,3,1.9,26,0,89,60,77,86,94,85,65,0,0]
[59,null,"Féverole, graine ",1000,7.29,7.73,126,191.7,104.2,230.3,296,17.8,94.8,550.29999999999995,41,958.9,41.1,1,6.9,1.8,0,0,83,75,70,60,91,80,90,420.7,75,null,59,"Féverole, graine ",1000,7.29,7.73,126,191.7,104.2,230.3,296,17.8,94.8,550.29999999999995,41,958.9,41.1,1,6.9,1.8,13,null,83,75,70,60,91,80,90,420.7,75,115,"Kartoffel, Knolle frisch",1000,7.65,8.4600000000000009,74.599999999999994,58.6,90.4,72.900000000000006,93.7,4,22.8,819.4,35,939.9,60.1,1,2.5,1,22,0,88,55,30,70,93,80,80,722.9,75]
[60,null,"Haricot toasté, graine ",1000,7.7,8.35,147.5,173.8,105.2,162.9,257,17,53,624,53,951,49,1.6,5.3,1.8,0,0,87,85,70,60,90,67,85,403.6,75,null,60,"Haricot toasté, graine ",1000,7.7,8.35,147.5,173.8,105.2,162.9,257,17,53,624,53,951,49,1.6,5.3,1.8,15,null,87,85,70,60,90,67,85,403.6,75,120,"Kartoffelflocken",1000,8.01,8.93,94.3,59.9,103.2,55.3,90.4,2.7,25.3,835.5,40,954,46,0.6,2.5,1.1000000000000001,20,0,90,48,40,73,96,65,80,748.4,85]
[61,null,"Lactosérum concentré 12 % MS",1000,7.96,8.9499999999999993,103.6,84,121.2,100.9,129.6,5.9,0,787.5,0,923,77,0,0,0,0,0,94,90,90,0,95,80,90,0,0,null,61,"Lactosérum concentré 12 % MS",1000,7.96,8.9499999999999993,103.6,84,121.2,100.9,129.6,5.9,0,787.5,null,923,77,null,null,null,null,null,94,90,90,0,95,80,90,0,0,119,"Kartoffelmehl",1000,7.68,8.5,94.8,62.3,101.7,56.9,89.7,2.6,25,832.9,41,950.2,49.8,0.6,2.4,0.8,18,0,89,48,30,73,93,67,90,746,85]
[62,null,"Lactosérum concentré 18 % MS",1000,7.96,8.9499999999999993,103.6,84,121.2,100.9,129.6,5.9,0,787.5,0,923,77,0,0,0,0,0,94,90,90,0,95,80,90,0,0,null,62,"Lactosérum concentré 18 % MS",1000,7.96,8.9499999999999993,103.6,84,121.2,100.9,129.6,5.9,0,787.5,null,923,77,null,null,null,null,null,94,90,90,0,95,80,90,0,0,121,"Kartoffelprotein",1000,7.94,8.23,492.8,644.70000000000005,54.3,324.7,833.5,24.7,4.9000000000000004,100.2,6,963.3,36.700000000000003,1.2,3.3,1,18,0,89,89,30,50,93,45,90,0,0]
[63,null,"Lactosérum concentré 25 % MS",1000,7.96,8.9499999999999993,103.6,84,121.2,100.9,129.6,5.9,0,787.5,0,923,77,0,0,0,0,0,94,90,90,0,95,80,90,0,0,null,63,"Lactosérum concentré 25 % MS",1000,7.96,8.9499999999999993,103.6,84,121.2,100.9,129.6,5.9,0,787.5,null,923,77,null,null,null,null,null,94,90,90,0,95,80,90,0,0,118,"Kartoffelstärke",1000,8.84,10.01,65.5,1.4,101,1.1000000000000001,2,1.5,2.4,990.1,0,996,4,0.2,0.5,0.1,1,0,95,40,30,40,95,60,80,988,75]
[64,null,"Lactosérum frais (petit-lait)",1000,7.9,8.8800000000000008,102.6,83.5,119.8,100.3,128.9,7.2,0,777.6,709,913.7,86.3,5.8,6.1,1.1000000000000001,0,0,94,90,90,0,95,80,90,0,0,null,64,"Lactosérum frais (petit-lait)",1000,7.9,8.8800000000000008,102.6,83.5,119.8,100.3,128.9,7.2,0,777.6,709,913.7,86.3,5.8,6.1,1.1000000000000001,23,null,94,90,90,0,95,80,90,0,0,38,"Kaseinpulver",1000,8.6999999999999993,9.1999999999999993,163,559,112,813,914,14,0,17,0,945,55,2.6,7.7,0.2,1,0,95,95,90,0,95,90,90,0,0]
[{"$f":"IF($H$42=1,AG165,BK165)","v":65},null,{"$f":"IF($H$42=1,AH165,BL165)","v":"Lactosérum, poudre (petit-lait)"},{"$f":"IF($H$42=1,AI165,BM165)","v":1000},{"$f":"IF($H$42=1,AJ165,BN165)","v":7.9},{"$f":"IF($H$42=1,AK165,BO165)","v":8.9},{"$f":"IF($H$42=1,AL165,BP165)","v":103},{"$f":"IF($H$42=1,AM165,BQ165)","v":82},{"$f":"IF($H$42=1,AN165,BR165)","v":120},{"$f":"IF($H$42=1,AO165,BS165)","v":99},{"$f":"IF($H$42=1,AP165,BT165)","v":127},{"$f":"IF($H$42=1,AQ165,BU165)","v":10},{"$f":"IF($H$42=1,AR165,BV165)","v":0},{"$f":"IF($H$42=1,AS165,BW165)","v":777},{"$f":"IF($H$42=1,AT165,BX165)","v":725},{"$f":"IF($H$42=1,AU165,BY165)","v":914},{"$f":"IF($H$42=1,AV165,BZ165)","v":86},{"$f":"IF($H$42=1,AW165,CA165)","v":5.8},{"$f":"IF($H$42=1,AX165,CB165)","v":6.5},{"$f":"IF($H$42=1,AY165,CC165)","v":1.1000000000000001},{"$f":"IF($H$42=1,BA165,CD165)","v":0},0,94,90,90,0,95,80,90,0,0,null,65,"Lactosérum, poudre (petit-lait)",1000,7.9,8.9,103,82,120,99,127,10,0,777,725,914,86,5.8,6.5,1.1000000000000001,24,null,94,90,90,0,95,80,90,0,0,39,"Kohlrübe, Wurzel frisch",1000,7.26,7.94,86.9,69.900000000000006,108.9,91.8,118,12,111,663,401,904,96,5.0999999999999996,4,1.6,30,0,87,70,60,82,92,80,65,0,0]
[66,null,"Lait écrémé frais ",1000,8.1199999999999992,8.9600000000000009,145.5,233,114.8,279.8,359.7,8.1999999999999993,0,549.6,491,917.4,82.6,13.7,10.8,1.1000000000000001,0,{"$f":"IF($H$42=1,BA166,CE166)","v":0},95,95,90,0,95,80,90,0,0,null,66,"Lait écrémé frais ",1000,8.1199999999999992,8.9600000000000009,145.5,233,114.8,279.8,359.7,8.1999999999999993,0,549.6,491,917.4,82.6,13.7,10.8,1.1000000000000001,17,null,95,95,90,0,95,80,90,0,0,49,"Kokosextraktionsschrot",1000,6.79,7.13,186.2,184.9,82.7,90.1,238,27,161,499,125,925,75,1.8,6.5,3.9,18,0,79,80,80,60,85,44,90,0,0]
[67,null,"Lait écrémé, poudre ",1000,8.07,8.9,145.5,233,114.8,279.8,359.7,8.1999999999999993,0,549.6,508,918,82,13.6,10.6,1.1000000000000001,0,0,95,94,90,0,95,80,90,0,0,null,67,"Lait écrémé, poudre ",1000,8.07,8.9,145.5,233,114.8,279.8,359.7,8.1999999999999993,0,549.6,508,918,82,13.6,10.6,1.1000000000000001,16,null,95,94,90,0,95,80,90,0,0,76,"Leinextraktionsschrot",1000,6.66,6.89,161.80000000000001,224.5,78.7,196.7,327.60000000000002,38.799999999999997,95.4,471.3,54,933.1,66.900000000000006,4.5,9.5,6,12,0,75,83,80,22,80,64,85,0,0]
[68,null,"Lait entier frais ",1000,13.75,15.95,98.3,158.19999999999999,77.3,190,244.2,333,0,365.9,365,943.1,56.9,9.3000000000000007,7.5,0.8,0,0,97,95,98,0,97,80,90,0,0,null,68,"Lait entier frais ",1000,13.75,15.95,98.3,158.19999999999999,77.3,190,244.2,333,0,365.9,365,943.1,56.9,9.3000000000000007,7.5,0.8,11,null,97,95,98,0,97,80,90,0,0,73,"Leinkuchen > 11 % RL",1000,8.3000000000000007,8.84,158.4,231.7,68,203,338.1,134.30000000000001,86.8,382.2,0,941.4,58.6,0,0,0,0,0,77,83,90,22,80,64,85,0,0]
[69,null,"Lait entier, poudre ",1000,12.32,14.18,108.5,171.7,86.6,206.2,265,250,0,423,378,938,62,9.9,7.9,0.8,0,0,96,94,98,0,97,80,90,0,0,null,69,"Lait entier, poudre ",1000,12.32,14.18,108.5,171.7,86.6,206.2,265,250,0,423,378,938,62,9.9,7.9,0.8,15,null,96,94,98,0,97,80,90,0,0,74,"Leinkuchen 4-7% RL",1000,7.1,7.4,171,250,74,219,365,65,97,402,44,929,71,4.4000000000000004,8.6,5.3,12,0,76,83,90,22,80,64,85,0,0]
[70,null,"Levure de brasserie, séchée",1000,7.35,7.74,143.1,304.2,94.6,385.1,495,28.1,2,402.7,23,927.8,72.2,2.6,15,2.2000000000000002,0,0,84,82,61,50,88,80,75,0,0,null,70,"Levure de brasserie, séchée",1000,7.35,7.74,143.1,304.2,94.6,385.1,495,28.1,2,402.7,23,927.8,72.2,2.6,15,2.2000000000000002,24,null,84,82,61,50,88,80,75,0,0,75,"Leinkuchen 8 - 11 % RL",1000,7.84,8.2799999999999994,160.6,231.3,71.599999999999994,202.7,337.5,107.8,94.1,399.5,45,938.9,61.1,4.2,8.9,5.7,11,0,77,83,90,22,80,64,85,0,0]
[71,null,"Levure fourragère 48 % MA, séchée (Torula)",1000,7.38,7.73,145.69999999999999,327,89,414.1,532.20000000000005,41.2,7.4,347.5,3,928.3,71.7,7.3,15.6,1.2,0,0,82,82,61,50,88,80,75,52,0,null,71,"Levure fourragère 48 % MA, séchée (Torula)",1000,7.38,7.73,145.69999999999999,327,89,414.1,532.20000000000005,41.2,7.4,347.5,3,928.3,71.7,7.3,15.6,1.2,13,null,82,82,61,50,88,80,75,52,0,72,"Leinsamen",1000,13.06,14.69,75.2,143.80000000000001,39.299999999999997,162.80000000000001,225.4,430.8,82.2,221.3,37,959.7,40.299999999999997,2.7,5.8,4.5999999999999996,9,0,79,80,93,30,72,75,80,0,0]
[72,null,"Lin, graine ",1000,13.06,14.69,75.2,143.80000000000001,39.299999999999997,162.80000000000001,225.4,430.8,82.2,221.3,37,959.7,40.299999999999997,2.7,5.8,4.5999999999999996,0,0,79,80,93,30,72,75,80,0,0,null,72,"Lin, graine ",1000,13.06,14.69,75.2,143.80000000000001,39.299999999999997,162.80000000000001,225.4,430.8,82.2,221.3,37,959.7,40.299999999999997,2.7,5.8,4.5999999999999996,9,null,79,80,93,30,72,75,80,0,0,78,"Lupine, Samen, süss blau",1000,8.65,9.3699999999999992,142,233.6,104,275.10000000000002,358.7,67.3,152.4,388.2,0,966.6,33.4,0,0,0,0,0,89,85,88,88,92,79,90,91.4,0]
[73,null,"Lin, tourteau de pression > 11 % MG",1000,8.3000000000000007,8.84,158.4,231.7,68,203,338.1,134.30000000000001,86.8,382.2,0,941.4,58.6,0,0,0,0,0,77,83,90,22,80,64,85,0,0,null,73,"Lin, tourteau de pression > 11 % MG",1000,8.3000000000000007,8.84,158.4,231.7,68,203,338.1,134.30000000000001,86.8,382.2,null,941.4,58.6,null,null,null,null,null,77,83,90,22,80,64,85,0,0,77,"Lupine, Samen, süss weiss",1000,9.1,9.9,143,257,99,308,396,95,121,347,66,959,41,2.5,5.0999999999999996,2.2999999999999998,12,0,89,88,88,88,92,80,90,0,0]
[74,null,"Lin, tourteau de pression, 4-7 % MG",1000,7.1,7.4,171,250,74,219,365,65,97,402,44,929,71,4.4000000000000004,8.6,5.3,0,0,76,83,90,22,80,64,85,0,0,null,74,"Lin, tourteau de pression, 4-7 % MG",1000,7.1,7.4,171,250,74,219,365,65,97,402,44,929,71,4.4000000000000004,8.6,5.3,12,null,76,83,90,22,80,64,85,0,0,66,"Magermilch frisch",1000,8.1199999999999992,8.9600000000000009,145.5,233,114.8,279.8,359.7,8.1999999999999993,0,549.6,491,917.4,82.6,13.7,10.8,1.1000000000000001,17,0,95,95,90,0,95,80,90,0,0]
[75,null,"Lin, tourteau de pression, 8-12 % MG",1000,7.84,8.2799999999999994,160.6,231.3,71.599999999999994,202.7,337.5,107.8,94.1,399.5,45,938.9,61.1,4.2,8.9,5.7,0,0,77,83,90,22,80,64,85,0,0,null,75,"Lin, tourteau de pression, 8-12 % MG",1000,7.84,8.2799999999999994,160.6,231.3,71.599999999999994,202.7,337.5,107.8,94.1,399.5,45,938.9,61.1,4.2,8.9,5.7,11,null,77,83,90,22,80,64,85,0,0,67,"Magermilchpulver",1000,8.07,8.9,145.5,233,114.8,279.8,359.7,8.1999999999999993,0,549.6,508,918,82,13.6,10.6,1.1000000000000001,16,0,95,94,90,0,95,80,90,0,0]
[76,null,"Lin, tourteau d'extraction ",1000,6.66,6.89,161.80000000000001,224.5,78.7,196.7,327.60000000000002,38.799999999999997,95.4,471.3,54,933.1,66.900000000000006,4.5,9.5,6,0,0,75,83,80,22,80,64,85,0,0,null,76,"Lin, tourteau d'extraction ",1000,6.66,6.89,161.80000000000001,224.5,78.7,196.7,327.60000000000002,38.799999999999997,95.4,471.3,54,933.1,66.900000000000006,4.5,9.5,6,12,null,75,83,80,22,80,64,85,0,0,84,"Mais, Körner",1000,8.6,9.57,102.9,78.7,68.599999999999994,34.299999999999997,96.3,47.2,19.3,822.2,19,985,15,0.2,3.2,1.2,4,0,88,60,79,20,94,42,95,726.1,70]
[77,null,"Lupin blanc doux, graine ",1000,9.1,9.9,143,257,99,308,396,95,121,347,66,959,41,2.5,5.0999999999999996,2.2999999999999998,0,0,{"$f":"IF($H$42=1,BB177,CF177)","v":89},{"$f":"IF($H$42=1,BC177,CG177)","v":88},{"$f":"IF($H$42=1,BD177,CH177)","v":88},{"$f":"IF($H$42=1,BE177,CI177)","v":88},{"$f":"IF($H$42=1,BF177,CJ177)","v":92},{"$f":"IF($H$42=1,BG177,CK177)","v":80},{"$f":"IF($H$42=1,BH177,CL177)","v":90},{"$f":"IF($H$42=1,BI177,CM177)","v":0},{"$f":"IF($H$42=1,BJ177,CN177)","v":0},null,77,"Lupin blanc doux, graine ",1000,9.1,9.9,143,257,99,308,396,95,121,347,66,959,41,2.5,5.0999999999999996,2.2999999999999998,12,null,89,88,88,88,92,80,90,0,0,82,"Maisfuttermehl",1000,8.11,8.85,99.2,82.6,66.3,45.2,116,75,58,717,42,966,34,0.6,5.0999999999999996,2.6,6,0,82,62,85,60,87,45,80,490,75]
[78,null,"Lupin bleu doux, graine ",1000,8.65,9.3699999999999992,142,233.6,104,275.10000000000002,358.7,67.3,152.4,388.2,0,966.6,33.4,0,0,0,0,0,89,85,88,88,92,79,90,91.4,0,null,78,"Lupin bleu doux, graine ",1000,8.65,9.3699999999999992,142,233.6,104,275.10000000000002,358.7,67.3,152.4,388.2,null,966.6,33.4,null,null,null,null,null,89,85,88,88,92,79,90,91.4,0,83,"Maiskeime",1000,9.66,10.67,96.3,102.2,61.6,78.900000000000006,142,211.8,48.4,542.9,73,945.1,54.9,0.1,1.2,0.4,1,0,81,70,85,60,85,60,90,287.5,75]
[79,null,"Maïs 60 % MA, gluten ",1000,8.58,9.1,500.6,555.79999999999995,48,149.80000000000001,671.8,55.7,9.6999999999999993,236.9,8,974.1,25.9,0.2,5.2,0.3,0,0,88,88,76,20,94,30,90,164.7,75,null,79,"Maïs 60 % MA, gluten ",1000,8.58,9.1,500.6,555.79999999999995,48,149.80000000000001,671.8,55.7,9.6999999999999993,236.9,8,974.1,25.9,0.2,5.2,0.3,1,null,88,88,76,20,94,30,90,164.7,75,79,"Maiskleber 60 % RP",1000,8.58,9.1,500.6,555.79999999999995,48,149.80000000000001,671.8,55.7,9.6999999999999993,236.9,8,974.1,25.9,0.2,5.2,0.3,1,0,88,88,76,20,94,30,90,164.7,75]
[80,null,"Maïs 70 % MA, gluten ",1000,8.6,9.0299999999999994,563,640.5,33.700000000000003,172.6,774.2,74.2,11.7,104.5,5,964.6,35.4,0.2,4.0999999999999996,0.3,0,0,88,88,76,20,94,30,90,72.7,75,null,80,"Maïs 70 % MA, gluten ",1000,8.6,9.0299999999999994,563,640.5,33.700000000000003,172.6,774.2,74.2,11.7,104.5,5,964.6,35.4,0.2,4.0999999999999996,0.3,1,null,88,88,76,20,94,30,90,72.7,75,80,"Maiskleber 70 % RP",1000,8.6,9.0299999999999994,563,640.5,33.700000000000003,172.6,774.2,74.2,11.7,104.5,5,964.6,35.4,0.2,4.0999999999999996,0.3,1,0,88,88,76,20,94,30,90,72.7,75]
[81,null,"Maïs, aliment de gluten (gluten feed)",1000,7.4,7.94,130.1,156.19999999999999,93.7,149.6,232,26,78,606,23,942,58,1.5,9.5,4.0999999999999996,0,0,83,80,81,66,87,68,85,237.2,75,null,81,"Maïs, aliment de gluten (gluten feed)",1000,7.4,7.94,130.1,156.19999999999999,93.7,149.6,232,26,78,606,23,942,58,1.5,9.5,4.0999999999999996,14,null,83,80,81,66,87,68,85,237.2,75,81,"Maiskleberfutter",1000,7.4,7.94,130.1,156.19999999999999,93.7,149.6,232,26,78,606,23,942,58,1.5,9.5,4.0999999999999996,14,0,83,80,81,66,87,68,85,237.2,75]
[82,null,"Maïs, farine fourragère ",1000,8.11,8.85,99.2,82.6,66.3,45.2,116,75,58,717,42,966,34,0.6,5.0999999999999996,2.6,0,0,82,62,85,60,87,45,80,490,75,null,82,"Maïs, farine fourragère ",1000,8.11,8.85,99.2,82.6,66.3,45.2,116,75,58,717,42,966,34,0.6,5.0999999999999996,2.6,6,null,82,62,85,60,87,45,80,490,75,85,"Maiskolbenschrot getrocknet",1000,7.74,8.42,71,54.2,67.599999999999994,46.1,83,35,90,773,33,981,19,0.3,2.7,1,4,0,83,55,75,55,90,60,75,559.1,75]
[83,null,"Maïs, germes ",1000,9.66,10.67,96.3,102.2,61.6,78.900000000000006,142,211.8,48.4,542.9,73,945.1,54.9,0.1,1.2,0.4,0,0,81,70,85,60,85,60,90,287.5,75,null,83,"Maïs, germes ",1000,9.66,10.67,96.3,102.2,61.6,78.900000000000006,142,211.8,48.4,542.9,73,945.1,54.9,0.1,1.2,0.4,1,null,81,70,85,60,85,60,90,287.5,75,86,"Maiskolbensilage ohne Lieschblätter, 30 % Spindeln",1000,8.16,8.9700000000000006,87.2,63.6,74.5,42.1,94.7,46.7,32.799999999999997,809.8,8,984,16,0.2,3,1.2,7,50,84,60,79,40,90,50,75,646.20000000000005,75]
[84,null,"Maïs, grain ",1000,8.6,9.57,102.9,78.7,68.599999999999994,34.299999999999997,96.3,47.2,19.3,822.2,19,985,15,0.2,3.2,1.2,0,0,88,60,79,20,94,42,95,726.1,70,null,84,"Maïs, grain ",1000,8.6,9.57,102.9,78.7,68.599999999999994,34.299999999999997,96.3,47.2,19.3,822.2,19,985,15,0.2,3.2,1.2,4,null,88,60,79,20,94,42,95,726.1,70,87,"Maiskolbensilage ohne Lieschblätter, 80 % Spindeln",1000,7.85,8.57,84.5,55.8,77.900000000000006,36.9,83,36,85,781,8,985,15,0.2,3,1.2,5,50,84,60,79,50,90,50,75,625.4,75]
[85,null,"Maïs-épis, complet, séché ",1000,7.74,8.42,71,54.2,67.599999999999994,46.1,83,35,90,773,33,981,19,0.3,2.7,1,0,0,83,55,75,55,90,60,75,559.1,75,null,85,"Maïs-épis, complet, séché ",1000,7.74,8.42,71,54.2,67.599999999999994,46.1,83,35,90,773,33,981,19,0.3,2.7,1,4,null,83,55,75,55,90,60,75,559.1,75,88,"Maiskörnersilage",1000,8.6300000000000008,9.61,94.8,65.099999999999994,78.2,35.6,91.4,44.4,18.899999999999999,831.3,7,986,14,0.2,3.2,1.2,4,50,89,60,79,30,94,45,80,729.5,75]
[86,null,"Maïs-épis, ensilé, sans spathes, 30 % de rafles",1000,8.16,8.9700000000000006,87.2,63.6,74.5,42.1,94.7,46.7,32.799999999999997,809.8,8,984,16,0.2,3,1.2,50,50,84,60,79,40,90,50,75,646.20000000000005,75,null,86,"Maïs-épis, ensilé, sans spathes, 30 % de rafles",1000,8.16,8.9700000000000006,87.2,63.6,74.5,42.1,94.7,46.7,32.799999999999997,809.8,8,984,16,0.2,3,1.2,7,50,84,60,79,40,90,50,75,646.20000000000005,75,89,"Malzkeime getrocknet",1000,6.5,6.73,109.9,176.4,93.3,219.4,282,16,149,483,135,930,70,2.5,7.9,1.8,9,0,77,78,78,74,78,80,80,54.6,0]
[87,null,"Maïs-épis, ensilé, sans spathes, 80 % de rafles",1000,7.85,8.57,84.5,55.8,77.900000000000006,36.9,83,36,85,781,8,985,15,0.2,3,1.2,50,50,84,60,79,50,90,50,75,625.4,75,null,87,"Maïs-épis, ensilé, sans spathes, 80 % de rafles",1000,7.85,8.57,84.5,55.8,77.900000000000006,36.9,83,36,85,781,8,985,15,0.2,3,1.2,5,50,84,60,79,50,90,50,75,625.4,75,61,"Molkenkonzentrat 12 % TS",1000,7.96,8.9499999999999993,103.6,84,121.2,100.9,129.6,5.9,0,787.5,0,923,77,0,0,0,0,0,94,90,90,0,95,80,90,0,0]
[88,null,"Maïs-grain, ensilé ",1000,8.6300000000000008,9.61,94.8,65.099999999999994,78.2,35.6,91.4,44.4,18.899999999999999,831.3,7,986,14,0.2,3.2,1.2,50,50,89,60,79,30,94,45,80,729.5,75,null,88,"Maïs-grain, ensilé ",1000,8.6300000000000008,9.61,94.8,65.099999999999994,78.2,35.6,91.4,44.4,18.899999999999999,831.3,7,986,14,0.2,3.2,1.2,4,50,89,60,79,30,94,45,80,729.5,75,62,"Molkenkonzentrat 18 % TS",1000,7.96,8.9499999999999993,103.6,84,121.2,100.9,129.6,5.9,0,787.5,0,923,77,0,0,0,0,0,94,90,90,0,95,80,90,0,0]
[89,null,"Malt, germe, déshydraté",1000,6.5,6.73,109.9,176.4,93.3,219.4,282,16,149,483,135,930,70,2.5,7.9,1.8,0,0,77,78,78,74,78,80,80,54.6,0,null,89,"Malt, germe, déshydraté",1000,6.5,6.73,109.9,176.4,93.3,219.4,282,16,149,483,135,930,70,2.5,7.9,1.8,9,null,77,78,78,74,78,80,80,54.6,0,63,"Molkenkonzentrat 25 % TS",1000,7.96,8.9499999999999993,103.6,84,121.2,100.9,129.6,5.9,0,787.5,0,923,77,0,0,0,0,0,94,90,90,0,95,80,90,0,0]
[90,null,"Manioc, farine ",1000,7.46,8.27,71.900000000000006,15.5,99.4,12.8,23,3,48,861,32,935,65,2.9,1.1000000000000001,1.1000000000000001,0,0,87,41,40,20,92,60,80,724,0,null,90,"Manioc, farine ",1000,7.46,8.27,71.900000000000006,15.5,99.4,12.8,23,3,48,861,32,935,65,2.9,1.1000000000000001,1.1000000000000001,8,null,87,41,40,20,92,60,80,724,0,65,"Molkenpulver(Schottepulver)",1000,7.9,8.9,103,82,120,99,127,10,0,777,725,914,86,5.8,6.5,1.1000000000000001,24,0,94,90,90,0,95,80,90,0,0]
[91,null,"Marc de poires, séché ",1000,4.16,3.75,54,12.7,68.8,5,44.6,13.5,372.3,558.20000000000005,188,988.6,11.4,1,0.9,0.3,0,0,53,40,39,35,65,20,25,0,0,null,91,"Marc de poires, séché ",1000,4.16,3.75,54,12.7,68.8,5,44.6,13.5,372.3,558.20000000000005,188,988.6,11.4,1,0.9,0.3,4,null,53,40,39,35,65,20,25,0,0,144,"Mühlennachprodukte-gemisch (MNG)",1000,6.4,6.7,93,110,88,128,177,43,90,636,62,946,54,1.5,10.9,3.9,11,0,72,75,75,40,76,75,75,0,0]
[92,null,"Marc de pommes, dépectinisé, séché",1000,4.41,4.09,57.3,23.3,61.1,9.1,81.3,37.1,317.5,499.6,160,935.5,64.5,13.1,1.2,0.3,0,0,56,40,39,49,65,20,25,0,0,null,92,"Marc de pommes, dépectinisé, séché",1000,4.41,4.09,57.3,23.3,61.1,9.1,81.3,37.1,317.5,499.6,160,935.5,64.5,13.1,1.2,0.3,1,null,56,40,39,49,65,20,25,0,0,123,"Na-Kaseinpulver",1000,8.76,9.27,169.3,577.1,117,838.4,943.1,8.8000000000000007,0,6.2,0,958.1,41.9,0,0,0,0,0,95,95,90,0,95,90,90,0,0]
[93,null,"Marc de pommes, séché ",1000,5.69,5.72,65.599999999999994,14.2,85.2,5.5,49.5,22.3,199.2,713.1,218,984.1,15.9,1.3,1.4,0.6,0,0,66,40,39,49,75,20,25,0,0,null,93,"Marc de pommes, séché ",1000,5.69,5.72,65.599999999999994,14.2,85.2,5.5,49.5,22.3,199.2,713.1,218,984.1,15.9,1.3,1.4,0.6,6,null,66,40,39,49,75,20,25,0,0,106,"Palmkernextraktionsschrot",1000,6.76,7.07,157.30000000000001,141.80000000000001,87.1,70.2,197,21,196,542,26,956,44,3,7.2,3.9,7,0,77,75,90,55,86,42,80,0,0]
[94,null,"Marc de raisins, séché ",1000,2.93,2.29,41.2,42.5,24.2,29.4,132,73,277,441,180,923,77,6.1,3,1.1000000000000001,0,0,36,13,49,37,40,30,25,0,0,null,94,"Marc de raisins, séché ",1000,2.93,2.29,41.2,42.5,24.2,29.4,132,73,277,441,180,923,77,6.1,3,1.1000000000000001,17,null,36,13,49,37,40,30,25,0,0,107,"Paniermehl",1000,8.4,9.36,109.9,89.1,122.9,100.9,139.6,10,5.5,826,61,981.1,18.899999999999999,0.3,2.1,0.5,2,0,91,85,82,47,92,75,80,651.79999999999995,94]
[95,null,"Mélasse de betteraves ",1000,7.6,8.5,76,74,118,128,128,0,0,757,625,885,115,1.5,0.1,0.2,0,0,92,75,0,0,95,100,0,0,0,null,95,"Mélasse de betteraves ",1000,7.6,8.5,76,74,118,128,128,0,0,757,625,885,115,1.5,0.1,0.2,40,null,92,75,0,0,95,100,0,0,0,112,"Proteinerbse, Samen",1000,8.07,8.82,123.6,149.1,114.7,172,227.6,19.100000000000001,64.2,655.6,69,967,33,1.3,5.0999999999999996,1.3,11,0,89,83,59,81,93,78,90,0,0]
[96,null,"Millet, grain, < 4 % CB (milocorn, sorgho)",1000,8,8.8000000000000007,102,73,81,40,102,29,23,828,11,982,18,0.4,3.5,1.4,0,0,85,53,81,24,91,45,80,730,75,null,96,"Millet, grain, < 4 % CB (milocorn, sorgho)",1000,8,8.8000000000000007,102,73,81,40,102,29,23,828,11,982,18,0.4,3.5,1.4,4,null,85,53,81,24,91,45,80,730,75,35,"Rande, Knolle, frisch",1000,6.96,7.54,82,81.8,104.3,115.9,139,17,73,662,110,891,109,2.7,2.7,2.1,33,0,85,65,64,79,90,85,65,0,0]
[{"$f":"IF($H$42=1,AG197,BK197)","v":97},null,{"$f":"IF($H$42=1,AH197,BL197)","v":"Millet, grain, > 6 % CB "},{"$f":"IF($H$42=1,AI197,BM197)","v":1000},{"$f":"IF($H$42=1,AJ197,BN197)","v":7.3},{"$f":"IF($H$42=1,AK197,BO197)","v":7.79},{"$f":"IF($H$42=1,AL197,BP197)","v":99.8},{"$f":"IF($H$42=1,AM197,BQ197)","v":88.5},{"$f":"IF($H$42=1,AN197,BR197)","v":61},{"$f":"IF($H$42=1,AO197,BS197)","v":48.4},{"$f":"IF($H$42=1,AP197,BT197)","v":124.2},{"$f":"IF($H$42=1,AQ197,BU197)","v":43.9},{"$f":"IF($H$42=1,AR197,BV197)","v":100.7},{"$f":"IF($H$42=1,AS197,BW197)","v":701.4},{"$f":"IF($H$42=1,AT197,BX197)","v":9},{"$f":"IF($H$42=1,AU197,BY197)","v":970.2},{"$f":"IF($H$42=1,AV197,BZ197)","v":29.8},{"$f":"IF($H$42=1,AW197,CA197)","v":0.4},{"$f":"IF($H$42=1,AX197,CB197)","v":3.5},{"$f":"IF($H$42=1,AY197,CC197)","v":1.4},{"$f":"IF($H$42=1,BA197,CD197)","v":0},0,78,71,81,20,88,45,80,559.20000000000005,75,null,97,"Millet, grain, > 6 % CB ",1000,7.3,7.79,99.8,88.5,61,48.4,124.2,43.9,100.7,701.4,9,970.2,29.8,0.4,3.5,1.4,4,null,78,71,81,20,88,45,80,559.20000000000005,75,47,"Raps-Extraktionsschrot",1000,6.2,6.4,140,247,80,274,385,18,124,388,99,915,85,9.9,14,5.0999999999999996,14,0,75,83,80,24,83,74,80,70.8,0]
[98,null,"Millet, grain, 4-6 % CB ",1000,7.6,8.1999999999999993,106,81,79,44,113,37,63,760,9,973,27,0.4,3.5,1.4,0,{"$f":"IF($H$42=1,BA198,CE198)","v":0},82,53,81,24,91,45,80,619.6,75,null,98,"Millet, grain, 4-6 % CB ",1000,7.6,8.1999999999999993,106,81,79,44,113,37,63,760,9,973,27,0.4,3.5,1.4,4,null,82,53,81,24,91,45,80,619.6,75,48,"Rapsextraktionsschrot 00-Typ > 2.5 % RL",1000,6.5,6.68,135.4,234.7,79.2,260.7,366.5,38.200000000000003,115.8,385.8,0,906.3,93.7,0,0,0,0,0,75,83,80,24,83,74,80,0,0]
[99,null,"Moutarde blanche, graine, toastée",1000,10.69,11.73,104.5,209.9,58.7,248.5,344,278,95,232,45,949,51,5.0999999999999996,9,3.1,0,0,81,87,89,54,74,75,70,0,0,null,99,"Moutarde blanche, graine, toastée",1000,10.69,11.73,104.5,209.9,58.7,248.5,344,278,95,232,45,949,51,5.0999999999999996,9,3.1,8,null,81,87,89,54,74,75,70,0,0,41,"Rapsextraktionsschrot 00-Typ 1.3 - 2.5 % RL",1000,6.41,6.56,142.1,248.9,81.599999999999994,276.39999999999998,388.6,23.8,116.4,388.1,0,916.9,83.1,0,0,0,0,0,75,83,80,24,83,74,80,0,0]
[100,null,"Orge, farine fourragère ",1000,7.7,8.3699999999999992,98.5,86.2,106.7,97.4,130.80000000000001,30.3,55.9,754.1,72,971.1,28.9,0.7,5.5,1.6,0,0,82,73,70,35,90,77,90,413,89,null,100,"Orge, farine fourragère ",1000,7.7,8.3699999999999992,98.5,86.2,106.7,97.4,130.80000000000001,30.3,55.9,754.1,72,971.1,28.9,0.7,5.5,1.6,7,null,82,73,70,35,90,77,90,413,89,45,"Rapskuchen >9% RL",1000,7.7,8.1999999999999993,128,224,74,249,350,108,112,352,119,922,78,8.6,12.8,5.2,17,0,77,83,90,28,83,74,80,83,0]
[101,null,"Orge, flocons ",1000,8.98,10.15,123.5,77.8,128.80000000000001,64,115.2,13.2,8.6,849.8,15,987,13,0.5,3,0.6,0,0,96,90,41,21,98,60,80,722.1,89,null,101,"Orge, flocons ",1000,8.98,10.15,123.5,77.8,128.80000000000001,64,115.2,13.2,8.6,849.8,15,987,13,0.5,3,0.6,3,null,96,90,41,21,98,60,80,722.1,89,40,"Rapskuchen 00-Typ",1000,7.69,8.11,129.6,225.8,75.099999999999994,250.8,352.6,100.7,111.3,358.1,0,922.7,77.3,0,0,0,0,0,77,83,90,28,83,74,80,0,0]
[102,null,"Orge, grain, léger (55-61 kg/hl)",1000,7.47,8.09,99.6,79.099999999999994,108.9,85.9,118.8,24.6,59.8,767.4,26,970.6,29.4,0.6,4.5,1.2,0,0,83,73,70,35,88,75,90,593.1,89,null,102,"Orge, grain, léger (55-61 kg/hl)",1000,7.47,8.09,99.6,79.099999999999994,108.9,85.9,118.8,24.6,59.8,767.4,26,970.6,29.4,0.6,4.5,1.2,6,null,83,73,70,35,88,75,90,593.1,89,42,"Rapskuchen 00-Typ kaltgepresst",1000,8.9600000000000009,9.65,90.1,201.4,72.3,273.8,328.5,177.9,97.5,326.8,0,930.7,69.3,0,0,0,0,0,78,83,90,28,83,85,80,0,0]
[103,null,"Orge, grain, lourd (70-74 kg/hl)",1000,7.96,8.7200000000000006,108.3,93.6,114.1,101.5,140.5,26.4,40.5,767.6,27,975,25,0.6,4.5,1.2,0,0,87,73,70,35,92,75,90,612.9,89,null,103,"Orge, grain, lourd (70-74 kg/hl)",1000,7.96,8.7200000000000006,108.3,93.6,114.1,101.5,140.5,26.4,40.5,767.6,27,975,25,0.6,4.5,1.2,6,null,87,73,70,35,92,75,90,612.9,89,44,"Rapskuchen 4-9% RL",1000,7.2,7.5,134,232,78,258,363,75,117,365,127,920,80,8.1,12.6,5.2,15,0,77,83,90,28,83,74,80,83,0]
[104,null,"Orge, grain, moyen (62-69 kg/hl)",1000,7.77,8.49,100.9,77.400000000000006,112,84,116.3,26.2,48.4,783.1,27,974,26,0.6,4.5,1.2,0,0,85,73,70,35,90,75,90,600.70000000000005,89,null,104,"Orge, grain, moyen (62-69 kg/hl)",1000,7.77,8.49,100.9,77.400000000000006,112,84,116.3,26.2,48.4,783.1,27,974,26,0.6,4.5,1.2,6,null,85,73,70,35,90,75,90,600.70000000000005,89,46,"Rapskuchen ausBio-Diesel",1000,8.4,9,95,196,82,267,320,140,101,368,114,929,71,8.1999999999999993,12.3,5,16,0,78,93,90,28,83,85,80,83,0]
[105,null,"Orge, issues ",1000,6.42,6.65,81.900000000000006,79.8,89.3,95.8,128.69999999999999,41.6,133,650.70000000000005,66,954,46,1.3,5.3,1.8,0,0,72,73,70,35,80,77,75,356.4,89,null,105,"Orge, issues ",1000,6.42,6.65,81.900000000000006,79.8,89.3,95.8,128.69999999999999,41.6,133,650.70000000000005,66,954,46,1.3,5.3,1.8,6,null,72,73,70,35,80,77,75,356.4,89,43,"Rapssamen 00-Typ",1000,13.77,15.57,45.2,115.8,34.700000000000003,161.19999999999999,207.2,475.4,83.7,190.6,52,956.9,43.1,4.5,8.1,3.1,9,0,79,75,94,24,73,80,50,30.8,0]
[106,null,"Palmiste, tourteau d'extraction",1000,6.76,7.07,157.30000000000001,141.80000000000001,87.1,70.2,197,21,196,542,26,956,44,3,7.2,3.9,0,0,77,75,90,55,86,42,80,0,0,null,106,"Palmiste, tourteau d'extraction",1000,6.76,7.07,157.30000000000001,141.80000000000001,87.1,70.2,197,21,196,542,26,956,44,3,7.2,3.9,7,null,77,75,90,55,86,42,80,0,0,131,"Reisfuttermehl, gelb",1000,8.5299999999999994,9.25,102.9,114.1,57.1,83.1,166,189,80,467,61,902,98,0.9,12.8,4.2,11,0,77,73,85,45,80,55,80,247.9,85]
[107,null,"Panure ",1000,8.4,9.36,109.9,89.1,122.9,100.9,139.6,10,5.5,826,61,981.1,18.899999999999999,0.3,2.1,0.5,0,0,91,85,82,47,92,75,80,651.79999999999995,94,null,107,"Panure ",1000,8.4,9.36,109.9,89.1,122.9,100.9,139.6,10,5.5,826,61,981.1,18.899999999999999,0.3,2.1,0.5,2,null,91,85,82,47,92,75,80,651.79999999999995,94,130,"Reisfuttermehl, weiss",1000,8.1,8.77,99.1,99,64.8,72.099999999999994,144,145,66,558,62,913,87,1,14,6.3,11,0,77,73,85,45,80,55,80,308.2,85]
[108,null,"Pâtes avec œufs",1000,8.5500000000000007,9.5,119.8,109.8,119.3,115.6,173.3,22.4,4.8,785,0,985.5,14.5,0,0,0,0,0,91,85,82,47,92,70,75,726.6,94,null,108,"Pâtes avec œufs",1000,8.5500000000000007,9.5,119.8,109.8,119.3,115.6,173.3,22.4,4.8,785,null,985.5,14.5,null,null,null,null,null,91,85,82,47,92,70,75,726.6,94,97,"Rispenhirse, Körner > 6 % RF",1000,7.3,7.79,99.8,88.5,61,48.4,124.2,43.9,100.7,701.4,9,970.2,29.8,0.4,3.5,1.4,4,0,78,71,81,20,88,45,80,559.20000000000005,75]
[109,null,"Pâtes sans œufs",1000,8.39,9.32,121.3,107.1,123.3,112.8,169.1,1.4,2,819.5,37,992,8,0.1,2.1,0.5,0,0,91,85,82,47,92,70,75,758.7,94,null,109,"Pâtes sans œufs",1000,8.39,9.32,121.3,107.1,123.3,112.8,169.1,1.4,2,819.5,37,992,8,0.1,2.1,0.5,2,null,91,85,82,47,92,70,75,758.7,94,133,"Roggen, Körner",1000,8.27,9.18,99.8,71.2,121.3,85.4,113,13.4,20.3,835.9,64,982.6,17.399999999999999,0.5,4.0999999999999996,1.2,5,0,89,70,67,30,94,78,80,648.9,96]
[110,null,"Plumes hydrolysées, farine ",1000,8.4,8.6999999999999993,494,595,19,197,885,67,9,13,0,974,26,5.2,3.6,0.4,0,0,84,86,84,0,0,30,70,0,0,null,110,"Plumes hydrolysées, farine ",1000,8.4,8.6999999999999993,494,595,19,197,885,67,9,13,0,974,26,5.2,3.6,0.4,1,null,84,86,84,0,0,30,70,0,0,99,"Senfsaat, weiss getoastet",1000,10.69,11.73,104.5,209.9,58.7,248.5,344,278,95,232,45,949,51,5.0999999999999996,9,3.1,8,0,81,87,89,54,74,75,70,0,0]
[111,null,"Poire, fruit ",1000,7.95,8.7899999999999991,82.1,11,124.1,14.8,19,11,151,797,529,978,22,0.7,0.6,0.5,0,0,89,60,30,65,95,80,60,0,0,null,111,"Poire, fruit ",1000,7.95,8.7899999999999991,82.1,11,124.1,14.8,19,11,151,797,529,978,22,0.7,0.6,0.5,5,null,89,60,30,65,95,80,60,0,0,139,"Sojabohne, Samen",1000,9.81,10.68,119.6,254.6,73.7,316.60000000000002,407,196,60,284,82,947,53,2.8,6.3,3,18,0,83,85,90,60,80,80,80,51.2,0]
[112,null,"Pois protéagineux, graine ",1000,8.07,8.82,123.6,149.1,114.7,172,227.6,19.100000000000001,64.2,655.6,69,967,33,1.3,5.0999999999999996,1.3,0,0,89,83,59,81,93,78,90,0,0,null,112,"Pois protéagineux, graine ",1000,8.07,8.82,123.6,149.1,114.7,172,227.6,19.100000000000001,64.2,655.6,69,967,33,1.3,5.0999999999999996,1.3,11,null,89,83,59,81,93,78,90,0,0,140,"Sojabohne, Samen extrudiert",1000,10,10.92,149.30000000000001,267.10000000000002,62.2,273.89999999999998,410.7,210.6,59.2,262.39999999999998,77,942.9,57.1,2.7,6.4,3.1,19,0,83,85,90,60,80,70,80,47.3,0]
[113,null,"Poisson 64 % MA, farine ",1000,7.83,8.2899999999999991,418.1,541.1,28.6,245.8,690,103,5,7,0,805,195,47.9,28.1,2.5,0,0,87,88,86,30,50,42,90,0,0,null,113,"Poisson 64 % MA, farine ",1000,7.83,8.2899999999999991,418.1,541.1,28.6,245.8,690,103,5,7,0,805,195,47.9,28.1,2.5,11,null,87,88,86,30,50,42,90,0,0,138,"Sojabohnenschalen",1000,6.67,6.93,102.9,82,97.5,72.3,130,24,373,420,26,947,53,5.5,1.8,2,13,0,79,60,75,80,85,60,70,60.2,0]
[114,null,"Poisson 70/72 % MA, farine ",1000,8.49,9,463.5,601.29999999999995,30.1,273.10000000000002,766.7,108.6,2.7,0,0,864.6,135.4,26.6,22.9,2,0,0,88,88,86,30,50,42,90,0,0,null,114,"Poisson 70/72 % MA, farine ",1000,8.49,9,463.5,601.29999999999995,30.1,273.10000000000002,766.7,108.6,2.7,0,0,864.6,135.4,26.6,22.9,2,11,null,88,88,86,30,50,42,90,0,0,135,"Sojaextraktionsschrot < 1.3 % RL, nicht entschält",1000,7.84,8.39,266.5,373.8,90.6,287.39999999999998,506.8,12.3,66.599999999999994,341.7,0,927.4,72.599999999999994,0,0,0,0,0,90,91,52,80,93,61,95,73.099999999999994,0]
[115,null,"Pomme de terre de consommation, crue",1000,7.65,8.4600000000000009,74.599999999999994,58.6,90.4,72.900000000000006,93.7,4,22.8,819.4,35,939.9,60.1,1,2.5,1,0,0,88,55,30,70,93,80,80,722.9,75,null,115,"Pomme de terre de consommation, crue",1000,7.65,8.4600000000000009,74.599999999999994,58.6,90.4,72.900000000000006,93.7,4,22.8,819.4,35,939.9,60.1,1,2.5,1,22,null,88,55,30,70,93,80,80,722.9,75,136,"Sojaextraktionsschrot > 2.5 % RL, nicht entschält",1000,8,8.52,265.3,375.8,86.9,288.89999999999998,509.5,42.2,56.4,325.60000000000002,0,933.7,66.3,0,0,0,0,0,90,91,52,80,93,61,95,69.7,0]
[116,null,"Pomme de terre fourragère, crue",1000,7.57,8.3800000000000008,74.900000000000006,56.9,91.5,70.8,91,3,23,812,37,929,71,1,2.5,1,0,0,89,55,30,70,93,80,80,697,75,null,116,"Pomme de terre fourragère, crue",1000,7.57,8.3800000000000008,74.900000000000006,56.9,91.5,70.8,91,3,23,812,37,929,71,1,2.5,1,22,null,89,55,30,70,93,80,80,697,75,137,"Sojaextraktionsschrot 1.3 - 2.5 % RL, nicht entschält",1000,7.86,8.39,264.8,372.6,88.9,286.5,505.2,23,64.599999999999994,333,0,925.8,74.2,0,0,0,0,0,90,91,52,80,93,61,95,71.3,0]
[117,null,"Pomme, fruit ",1000,8.11,9,82.7,13.4,124.2,17.899999999999999,23,19,104,832,554,978,22,0.6,0.7,0.5,0,0,90,60,30,65,95,80,60,0,0,null,117,"Pomme, fruit ",1000,8.11,9,82.7,13.4,124.2,17.899999999999999,23,19,104,832,554,978,22,0.6,0.7,0.5,9,null,90,60,30,65,95,80,60,0,0,134,"Sojaextraktionsschrot 48 % RP, entschält",1000,7.93,8.4600000000000009,282.89999999999998,406.3,87.8,312.39999999999998,550.82000000000005,16.87,44.18,318.51,0,930.38,69.62,0,0,0,0,0,90,91,52,80,93,61,95,67.900000000000006,0]
[118,null,"Pommes de terre, amidon ",1000,8.84,10.01,65.5,1.4,101,1.1000000000000001,2,1.5,2.4,990.1,0,996,4,0.2,0.5,0.1,0,0,95,40,30,40,95,60,80,988,75,null,118,"Pommes de terre, amidon ",1000,8.84,10.01,65.5,1.4,101,1.1000000000000001,2,1.5,2.4,990.1,0,996,4,0.2,0.5,0.1,1,null,95,40,30,40,95,60,80,988,75,142,"Soja-Extraktionsschrot,nicht entschält 44% RP",1000,7.8,8.3000000000000007,261,368,87,283,499,20,65,340,105,924,76,3.6,7.7,3.6,22,0,90,91,52,80,93,61,95,0,0]
[119,null,"Pommes de terre, farine ",1000,7.68,8.5,94.8,62.3,101.7,56.9,89.7,2.6,25,832.9,41,950.2,49.8,0.6,2.4,0.8,0,0,89,48,30,73,93,67,90,746,85,null,119,"Pommes de terre, farine ",1000,7.68,8.5,94.8,62.3,101.7,56.9,89.7,2.6,25,832.9,41,950.2,49.8,0.6,2.4,0.8,18,null,89,48,30,73,93,67,90,746,85,143,"Soja-Extraktionsschrot,teilentschält 48% RP",1000,7.9,8.4,277,398,86,306,539,17,53,322,102,931,69,3.5,7.4,3.1,24,0,90,91,52,80,93,61,95,0,0]
[120,null,"Pommes de terre, flocons ",1000,8.01,8.93,94.3,59.9,103.2,55.3,90.4,2.7,25.3,835.5,40,954,46,0.6,2.5,1.1000000000000001,0,0,90,48,40,73,96,65,80,748.4,85,null,120,"Pommes de terre, flocons ",1000,8.01,8.93,94.3,59.9,103.2,55.3,90.4,2.7,25.3,835.5,40,954,46,0.6,2.5,1.1000000000000001,20,null,90,48,40,73,96,65,80,748.4,85,141,"Sojakuchen, nichtentschält",1000,8.6999999999999993,9.4,249,349,84,268,473,71,62,322,99,928,72,3.1,6.8,3.2,22,0,90,91,90,70,93,61,95,70.3,0]
[121,null,"Pommes de terre, protéine ",1000,7.94,8.23,492.8,644.70000000000005,54.3,324.7,833.5,24.7,4.9000000000000004,100.2,6,963.3,36.700000000000003,1.2,3.3,1,0,0,89,89,30,50,93,45,90,0,0,null,121,"Pommes de terre, protéine ",1000,7.94,8.23,492.8,644.70000000000005,54.3,324.7,833.5,24.7,4.9000000000000004,100.2,6,963.3,36.700000000000003,1.2,3.3,1,18,null,89,89,30,50,93,45,90,0,0,146,"Sonnenblume,Samen",1000,9.9,10.6,58,123,37,153,197,325,261,181,52,964,36,2.4,5.5,2.8,8,0,64,80,96,18,55,80,80,14.5,0]
[122,null,"Poudre de caséine riche en Ca",1000,8.83,9.35,168.5,577.20000000000005,115.8,838.6,943.3,14.3,0,0,0,955,45.1,0,0,0,0,0,95,95,90,0,95,90,90,0,0,null,122,"Poudre de caséine riche en Ca",1000,8.83,9.35,168.5,577.20000000000005,115.8,838.6,943.3,14.3,0,0,null,955,45.1,null,null,null,null,null,95,95,90,0,95,90,90,0,0,145,"Sonnenblumenextraktionsschrot, entschält",1000,6.8,7.02,154.30000000000001,281.5,87.4,318.3,427.5,26.6,151.69999999999999,315.60000000000002,0,921.4,78.599999999999994,0,0,0,0,0,79,89,81,43,82,77,90,0,0]
[123,null,"Poudre de caséine riche en Na",1000,8.76,9.27,169.3,577.1,117,838.4,943.1,8.8000000000000007,0,6.2,0,958.1,41.9,0,0,0,0,0,95,95,90,0,95,90,90,0,0,null,123,"Poudre de caséine riche en Na",1000,8.76,9.27,169.3,577.1,117,838.4,943.1,8.8000000000000007,0,6.2,null,958.1,41.9,null,null,null,null,null,95,95,90,0,95,90,90,0,0,151,"Sonnenblumenextraktionsschrot, nicht entschält",1000,4.8499999999999996,4.3899999999999997,78.2,154.4,38,174.6,234.4,112.8,407.4,198.3,0,952.9,47.1,0,0,0,0,0,45,83,92,15,35,77,90,0,0]
[124,null,"Protéine fourragère 70 % MA (protéine bactérienne)",1000,8.75,9.26,124.6,433.1,105.2,652.9,734.4,75.599999999999994,11.7,139.5,5,961.2,38.799999999999997,2.7,14,2.1,0,0,91,94,61,50,88,90,70,0,0,null,124,"Protéine fourragère 70 % MA (protéine bactérienne)",1000,8.75,9.26,124.6,433.1,105.2,652.9,734.4,75.599999999999994,11.7,139.5,5,961.2,38.799999999999997,2.7,14,2.1,3,null,91,94,61,50,88,90,70,0,0,153,"Sonnenblumenextraktionsschrot, teilentschält",1000,4.92,4.6399999999999997,119.9,217.8,68.5,246.3,330.7,20.7,271.39999999999998,295.39999999999998,77,918.2,81.8,3.9,9.4,5.2,15,0,62,85,70,32,60,77,90,0,0]
[125,null,"Rave ",1000,6.4,6.9,81,79,96,103,133,15,117,615,353,880,120,5.9,5.8,0.7,0,0,82,83,74,93,80,80,65,0,0,null,125,"Rave ",1000,6.4,6.9,81,79,96,103,133,15,117,615,353,880,120,5.9,5.8,0.7,46,null,82,83,74,93,80,80,65,0,0,147,"Sonnenblumenkerne > 24 % RF, nicht entschält",1000,10.3,11.05,55.1,118.3,33.6,147.1,189.1,350.9,280.60000000000002,148.80000000000001,0,969.4,30.6,0,0,0,0,0,64,80,96,18,55,80,80,0,0]
[126,null,"Rave sans feuilles début d'automne, fraîche, avec souillures",1000,6.02,6.42,80.099999999999994,89.6,90.8,117.7,151.30000000000001,7.5,108.8,542.20000000000005,0,809.8,190.2,0,0,0,0,0,82,83,74,93,80,80,65,0,0,null,126,"Rave sans feuilles début d'automne, fraîche, avec souillures",1000,6.02,6.42,80.099999999999994,89.6,90.8,117.7,151.30000000000001,7.5,108.8,542.20000000000005,null,809.8,190.2,null,null,null,null,null,82,83,74,93,80,80,65,0,0,148,"Sonnenblumenkerne 12 - 15 % RF, teilentschält",1000,14.15,16,39.9,92.6,21.2,115.2,148.1,518,143.19999999999999,154.30000000000001,0,963.6,36.4,0,0,0,0,0,72,82,94,23,66,80,80,0,0]
[127,null,"Rave sans feuilles début d'automne, fraîche, propre",1000,6.61,7.06,88,98.5,99.8,129.30000000000001,166.2,8.3000000000000007,119.6,595.9,0,890,110,0,0,0,0,0,82,83,74,93,80,80,65,0,0,null,127,"Rave sans feuilles début d'automne, fraîche, propre",1000,6.61,7.06,88,98.5,99.8,129.30000000000001,166.2,8.3000000000000007,119.6,595.9,null,890,110,null,null,null,null,null,82,83,74,93,80,80,65,0,0,149,"Sonnenblumenkerne 15 - 24 % RF, teilentschält",1000,13.29,14.83,41.1,89.3,24.6,111.1,142.80000000000001,497.5,227.5,98.1,0,965.9,34.1,0,0,0,0,0,72,82,94,23,66,80,80,0,0]
[128,null,"Rave sans feuilles fin d'automne, fraîche, propre",1000,6.62,7.13,76.5,46.5,101.7,61,78.400000000000006,13,99.7,698.9,0,890,110,0,0,0,0,0,82,83,74,93,80,80,65,0,0,null,128,"Rave sans feuilles fin d'automne, fraîche, propre",1000,6.62,7.13,76.5,46.5,101.7,61,78.400000000000006,13,99.7,698.9,null,890,110,null,null,null,null,null,82,83,74,93,80,80,65,0,0,152,"Sonnenblumenkuchen, nicht entschält",1000,4.12,3.64,97.7,167.9,61,189.9,255,15,370,310,50,950,50,4.8,8.5,5,13,0,52,84,68,30,50,77,90,0,0]
[{"$f":"IF($H$42=1,AG229,BK229)","v":129},null,{"$f":"IF($H$42=1,AH229,BL229)","v":"Riz, brisures "},{"$f":"IF($H$42=1,AI229,BM229)","v":1000},{"$f":"IF($H$42=1,AJ229,BN229)","v":8.56},{"$f":"IF($H$42=1,AK229,BO229)","v":9.6},{"$f":"IF($H$42=1,AL229,BP229)","v":89.7},{"$f":"IF($H$42=1,AM229,BQ229)","v":60.5},{"$f":"IF($H$42=1,AN229,BR229)","v":84.9},{"$f":"IF($H$42=1,AO229,BS229)","v":44.1},{"$f":"IF($H$42=1,AP229,BT229)","v":88},{"$f":"IF($H$42=1,AQ229,BU229)","v":9.9},{"$f":"IF($H$42=1,AR229,BV229)","v":3.2},{"$f":"IF($H$42=1,AS229,BW229)","v":890.9},{"$f":"IF($H$42=1,AT229,BX229)","v":48},{"$f":"IF($H$42=1,AU229,BY229)","v":992},{"$f":"IF($H$42=1,AV229,BZ229)","v":8},{"$f":"IF($H$42=1,AW229,CA229)","v":0.1},{"$f":"IF($H$42=1,AX229,CB229)","v":1.4},{"$f":"IF($H$42=1,AY229,CC229)","v":0.4},{"$f":"IF($H$42=1,BA229,CD229)","v":0},0,92,71,67,30,94,55,80,840.5,75,null,129,"Riz, brisures ",1000,8.56,9.6,89.7,60.5,84.9,44.1,88,9.9,3.2,890.9,48,992,8,0.1,1.4,0.4,1,null,92,71,67,30,94,55,80,840.5,75,150,"Sonnenblumenkuchen, teilentschält",1000,6.57,6.61,104,185.1,61.5,209.3,281.10000000000002,114,256.5,276,83,927.6,72.400000000000006,3.2,9.4,6.6,16,0,65,85,93,32,60,77,90,0,0]
[130,null,"Riz, farine fourragère blanche",1000,8.1,8.77,99.1,99,64.8,72.099999999999994,144,145,66,558,62,913,87,1,14,6.3,0,{"$f":"IF($H$42=1,BA230,CE230)","v":0},77,73,85,45,80,55,80,308.2,85,null,130,"Riz, farine fourragère blanche",1000,8.1,8.77,99.1,99,64.8,72.099999999999994,144,145,66,558,62,913,87,1,14,6.3,11,null,77,73,85,45,80,55,80,308.2,85,2,"Stärke, Getreide-",1000,8.8000000000000007,10,69,13,99,13,19,1,4,968,0,992,8,0.3,1.4,0.2,1,0,94,60,60,30,95,70,90,967,75]
[131,null,"Riz, farine fourragère jaune",1000,8.5299999999999994,9.25,102.9,114.1,57.1,83.1,166,189,80,467,61,902,98,0.9,12.8,4.2,0,0,77,73,85,45,80,55,80,247.9,85,null,131,"Riz, farine fourragère jaune",1000,8.5299999999999994,9.25,102.9,114.1,57.1,83.1,166,189,80,467,61,902,98,0.9,12.8,4.2,11,null,77,73,85,45,80,55,80,247.9,85,127,"Stoppelrübe, ohne Blätter, Frühherbst, sauber",1000,6.61,7.06,88,98.5,99.8,129.30000000000001,166.2,8.3000000000000007,119.6,595.9,0,890,110,0,0,0,0,0,82,83,74,93,80,80,65,0,0]
[132,null,"Sang, farine ",1000,7.64,7.79,643.6,725.8,14.5,159.5,952.5,6.5,2.7,3.7,0,965.4,34.6,1.7,1.7,0.3,0,0,85,85,90,0,50,25,80,0,0,null,132,"Sang, farine ",1000,7.64,7.79,643.6,725.8,14.5,159.5,952.5,6.5,2.7,3.7,0,965.4,34.6,1.7,1.7,0.3,3,null,85,85,90,0,50,25,80,0,0,126,"Stoppelrübe, ohne Blätter, Frühherbst, verschmutzt",1000,6.02,6.42,80.099999999999994,89.6,90.8,117.7,151.30000000000001,7.5,108.8,542.20000000000005,0,809.8,190.2,0,0,0,0,0,82,83,74,93,80,80,65,0,0]
[133,null,"Seigle, grain ",1000,8.27,9.18,99.8,71.2,121.3,85.4,113,13.4,20.3,835.9,64,982.6,17.399999999999999,0.5,4.0999999999999996,1.2,0,0,89,70,67,30,94,78,80,648.9,96,null,133,"Seigle, grain ",1000,8.27,9.18,99.8,71.2,121.3,85.4,113,13.4,20.3,835.9,64,982.6,17.399999999999999,0.5,4.0999999999999996,1.2,5,null,89,70,67,30,94,78,80,648.9,96,128,"Stoppelrübe, ohne Blätter, Spätherbst, sauber",1000,6.62,7.13,76.5,46.5,101.7,61,78.400000000000006,13,99.7,698.9,0,890,110,0,0,0,0,0,82,83,74,93,80,80,65,0,0]
[134,null,"Soja décortiqué, tourteau d'extraction 48 % MA",1000,7.93,8.4600000000000009,282.89999999999998,406.3,87.8,312.39999999999998,550.82000000000005,16.87,44.18,318.51,0,930.38,69.62,0,0,0,0,0,90,91,52,80,93,61,95,67.900000000000006,0,null,134,"Soja décortiqué, tourteau d'extraction 48 % MA",1000,7.93,8.4600000000000009,282.89999999999998,406.3,87.8,312.39999999999998,550.82000000000005,16.87,44.18,318.51,null,930.38,69.62,null,null,null,null,null,90,91,52,80,93,61,95,67.900000000000006,0,125,"Stoppelrübe, ohneBlätter frisch",1000,6.4,6.9,81,79,96,103,133,15,117,615,353,880,120,5.9,5.8,0.7,46,0,82,83,74,93,80,80,65,0,0]
[135,null,"Soja non décortiqué, tourteau d'extraction",1000,7.84,8.39,266.5,373.8,90.6,287.39999999999998,506.8,12.3,66.599999999999994,341.7,0,927.4,72.599999999999994,0,0,0,0,0,90,91,52,80,93,61,95,73.099999999999994,0,null,135,"Soja non décortiqué, tourteau d'extraction",1000,7.84,8.39,266.5,373.8,90.6,287.39999999999998,506.8,12.3,66.599999999999994,341.7,null,927.4,72.599999999999994,null,null,null,null,null,90,91,52,80,93,61,95,73.099999999999994,0,90,"Tapiokamehl",1000,7.46,8.27,71.900000000000006,15.5,99.4,12.8,23,3,48,861,32,935,65,2.9,1.1000000000000001,1.1000000000000001,8,0,87,41,40,20,92,60,80,724,0]
[136,null,"Soja non décortiqué, tourteau d'extraction > 2.5 % % MG",1000,8,8.52,265.3,375.8,86.9,288.89999999999998,509.5,42.2,56.4,325.60000000000002,0,933.7,66.3,0,0,0,0,0,90,91,52,80,93,61,95,69.7,0,null,136,"Soja non décortiqué, tourteau d'extraction > 2.5 % % MG",1000,8,8.52,265.3,375.8,86.9,288.89999999999998,509.5,42.2,56.4,325.60000000000002,null,933.7,66.3,null,null,null,null,null,90,91,52,80,93,61,95,69.7,0,108,"Teigwaren mit Eiern",1000,8.5500000000000007,9.5,119.8,109.8,119.3,115.6,173.3,22.4,4.8,785,0,985.5,14.5,0,0,0,0,0,91,85,82,47,92,70,75,726.6,94]
[137,null,"soja non décortiqué, tourteau d'extraction 1.3 - 2.5 % MG",1000,7.86,8.39,264.8,372.6,88.9,286.5,505.2,23,64.599999999999994,333,0,925.8,74.2,0,0,0,0,0,90,91,52,80,93,61,95,71.3,0,null,137,"soja non décortiqué, tourteau d'extraction 1.3 - 2.5 % MG",1000,7.86,8.39,264.8,372.6,88.9,286.5,505.2,23,64.599999999999994,333,null,925.8,74.2,null,null,null,null,null,90,91,52,80,93,61,95,71.3,0,109,"Teigwaren ohne Eier",1000,8.39,9.32,121.3,107.1,123.3,112.8,169.1,1.4,2,819.5,37,992,8,0.1,2.1,0.5,2,0,91,85,82,47,92,70,75,758.7,94]
[138,null,"Soja, coques ",1000,6.67,6.93,102.9,82,97.5,72.3,130,24,373,420,26,947,53,5.5,1.8,2,0,0,79,60,75,80,85,60,70,60.2,0,null,138,"Soja, coques ",1000,6.67,6.93,102.9,82,97.5,72.3,130,24,373,420,26,947,53,5.5,1.8,2,13,null,79,60,75,80,85,60,70,60.2,0,94,"Traubentrester getrocknet",1000,2.93,2.29,41.2,42.5,24.2,29.4,132,73,277,441,180,923,77,6.1,3,1.1000000000000001,17,0,36,13,49,37,40,30,25,0,0]
[139,null,"Soja, graine ",1000,9.81,10.68,119.6,254.6,73.7,316.60000000000002,407,196,60,284,82,947,53,2.8,6.3,3,0,0,83,85,90,60,80,80,80,51.2,0,null,139,"Soja, graine ",1000,9.81,10.68,119.6,254.6,73.7,316.60000000000002,407,196,60,284,82,947,53,2.8,6.3,3,18,null,83,85,90,60,80,80,80,51.2,0,154,"Triticale, Körner",1000,8.31,9.23,104.4,78.599999999999994,121.6,90.6,121.7,15.6,25,818,42,980.3,19.7,0.6,4.3,1.1000000000000001,5,0,90,75,72,33,94,77,85,681.2,95]
[140,null,"Soja, graine, extrudée",1000,10,10.92,149.30000000000001,267.10000000000002,62.2,273.89999999999998,410.7,210.6,59.2,262.39999999999998,77,942.9,57.1,2.7,6.4,3.1,0,0,83,85,90,60,80,70,80,47.3,0,null,140,"Soja, graine, extrudée",1000,10,10.92,149.30000000000001,267.10000000000002,62.2,273.89999999999998,410.7,210.6,59.2,262.39999999999998,77,942.9,57.1,2.7,6.4,3.1,19,null,83,85,90,60,80,70,80,47.3,0,68,"Vollmilch, Kuh, Winter, frisch",1000,13.75,15.95,98.3,158.19999999999999,77.3,190,244.2,333,0,365.9,365,943.1,56.9,9.3000000000000007,7.5,0.8,11,0,97,95,98,0,97,80,90,0,0]
[141,null,"Soja, tourteau de pression, non décortiqué",1000,8.6999999999999993,9.4,249,349,84,268,473,71,62,322,99,928,72,3.1,6.8,3.2,0,0,{"$f":"IF($H$42=1,BB241,CF241)","v":90},{"$f":"IF($H$42=1,BC241,CG241)","v":91},{"$f":"IF($H$42=1,BD241,CH241)","v":90},{"$f":"IF($H$42=1,BE241,CI241)","v":70},{"$f":"IF($H$42=1,BF241,CJ241)","v":93},{"$f":"IF($H$42=1,BG241,CK241)","v":61},{"$f":"IF($H$42=1,BH241,CL241)","v":95},{"$f":"IF($H$42=1,BI241,CM241)","v":70.3},{"$f":"IF($H$42=1,BJ241,CN241)","v":0},null,141,"Soja, tourteau de pression, non décortiqué",1000,8.6999999999999993,9.4,249,349,84,268,473,71,62,322,99,928,72,3.1,6.8,3.2,22,null,90,91,90,70,93,61,95,70.3,0,69,"Vollmilchpulver, Kuh",1000,12.32,14.18,108.5,171.7,86.6,206.2,265,250,0,423,378,938,62,9.9,7.9,0.8,15,0,96,94,98,0,97,80,90,0,0]
[142,null,"Soja, tourteau d'extraction, 44 % MA, non décortiqué",1000,7.8,8.3000000000000007,261,368,87,283,499,20,65,340,105,924,76,3.6,7.7,3.6,0,0,90,91,52,80,93,61,95,0,0,null,142,"Soja, tourteau d'extraction, 44 % MA, non décortiqué",1000,7.8,8.3000000000000007,261,368,87,283,499,20,65,340,105,924,76,3.6,7.7,3.6,22,null,90,91,52,80,93,61,95,0,0,29,"Weizen, Körner",1000,8.5,9.4600000000000009,118.5,105.4,121.4,112.5,155.69999999999999,16.3,23.3,785.7,32,981,19.100000000000001,0.5,4.4000000000000004,1.2,4,0,91,78,83,51,95,75,94,656.3,94]
[143,null,"Soja, tourteau d'extraction, 48 % MA, partiel. décortiqué",1000,7.9,8.4,277,398,86,306,539,17,53,322,102,931,69,3.5,7.4,3.1,0,0,90,91,52,80,93,61,95,0,0,null,143,"Soja, tourteau d'extraction, 48 % MA, partiel. décortiqué",1000,7.9,8.4,277,398,86,306,539,17,53,322,102,931,69,3.5,7.4,3.1,24,null,90,91,52,80,93,61,95,0,0,23,"Weizen, Körner expandiert",1000,8.5,9.4600000000000009,132.30000000000001,111.3,117.9,94.9,155.19999999999999,19.5,20.5,779.4,0,974.6,25.4,0,0,0,0,0,91,78,83,51,95,65,94,651.1,94]
[144,null,"Sous-produits de meunerie, mélange",1000,6.4,6.7,93,110,88,128,177,43,90,636,62,946,54,1.5,10.9,3.9,0,0,72,75,75,40,76,75,75,0,0,null,144,"Sous-produits de meunerie, mélange",1000,6.4,6.7,93,110,88,128,177,43,90,636,62,946,54,1.5,10.9,3.9,11,null,72,75,75,40,76,75,75,0,0,30,"Weizenbollmehl",1000,7.35,7.84,100.4,122.1,97.6,146.30000000000001,193.6,45.8,56.3,668.1,65,963.8,36.299999999999997,1.2,8.5,2.8,7,0,79,81,75,33,83,78,80,390.7,94]
[145,null,"Tournesol décortiqué, tourteau d'extraction",1000,6.8,7.02,154.30000000000001,281.5,87.4,318.3,427.5,26.6,151.69999999999999,315.60000000000002,0,921.4,78.599999999999994,0,0,0,0,0,79,89,81,43,82,77,90,0,0,null,145,"Tournesol décortiqué, tourteau d'extraction",1000,6.8,7.02,154.30000000000001,281.5,87.4,318.3,427.5,26.6,151.69999999999999,315.60000000000002,null,921.4,78.599999999999994,null,null,null,null,null,79,89,81,43,82,77,90,0,0,26,"Weizenfuttermehl dunkel",1000,7.69,8.2899999999999991,101.4,117.4,101.3,140.80000000000001,186.2,50.6,46.7,680.5,64,964,36,1.2,8.8000000000000007,2.9,9,0,82,81,75,33,86,78,80,440,94]
[146,null,"Tournesol, graine ",1000,9.9,10.6,58,123,37,153,197,325,261,181,52,964,36,2.4,5.5,2.8,0,0,64,80,96,18,55,80,80,14.5,0,null,146,"Tournesol, graine ",1000,9.9,10.6,58,123,37,153,197,325,261,181,52,964,36,2.4,5.5,2.8,8,null,64,80,96,18,55,80,80,14.5,0,25,"Weizenfuttermehl hell",1000,8.8800000000000008,9.92,114.8,118.9,121.5,142.5,188.5,30.6,12.9,746.8,74,978.8,21.2,0.5,4.5,1.4,4,0,93,85,82,47,96,78,80,565.79999999999995,94]
[147,null,"Tournesol, graine non décortiquée > 24 % CB",1000,10.3,11.05,55.1,118.3,33.6,147.1,189.1,350.9,280.60000000000002,148.80000000000001,0,969.4,30.6,0,0,0,0,0,64,80,96,18,55,80,80,0,0,null,147,"Tournesol, graine non décortiquée > 24 % CB",1000,10.3,11.05,55.1,118.3,33.6,147.1,189.1,350.9,280.60000000000002,148.80000000000001,null,969.4,30.6,null,null,null,null,null,64,80,96,18,55,80,80,0,0,27,"Weizenkeime",1000,9.4,10.42,122.9,197.9,100.3,241.9,320,101,25.9,501.5,128,948.4,51.6,0.8,12.4,3.1,11,0,91,90,90,40,94,78,75,245,94]
[148,null,"Tournesol, graine partiellement décortiquée 12 - 15 % CB",1000,14.15,16,39.9,92.6,21.2,115.2,148.1,518,143.19999999999999,154.30000000000001,0,963.6,36.4,0,0,0,0,0,72,82,94,23,66,80,80,0,0,null,148,"Tournesol, graine partiellement décortiquée 12 - 15 % CB",1000,14.15,16,39.9,92.6,21.2,115.2,148.1,518,143.19999999999999,154.30000000000001,null,963.6,36.4,null,null,null,null,null,72,82,94,23,66,80,80,0,0,28,"Weizenkleber",1000,9.36,10.039999999999999,256.89999999999998,549.1,102.7,621.79999999999995,860.6,26.9,3.9,98.3,4,989.7,10.3,1,2.2000000000000002,0.5,1,0,96,96,90,40,97,75,80,61.8,0]
[149,null,"Tournesol, graine partiellement décortiquée 15 - 24 % CB",1000,13.29,14.83,41.1,89.3,24.6,111.1,142.80000000000001,497.5,227.5,98.1,0,965.9,34.1,0,0,0,0,0,72,82,94,23,66,80,80,0,0,null,149,"Tournesol, graine partiellement décortiquée 15 - 24 % CB",1000,13.29,14.83,41.1,89.3,24.6,111.1,142.80000000000001,497.5,227.5,98.1,null,965.9,34.1,null,null,null,null,null,72,82,94,23,66,80,80,0,0,31,"Weizenkleie",1000,6.14,6.29,99.9,116.3,81.400000000000006,119.3,178.8,45.4,114.2,591.9,66,930.3,69.7,1.5,14,4.7,13,0,71,78,69,31,76,70,80,156,0]
[150,null,"Tournesol, tourteau de presse, partiel. décortiqué",1000,6.57,6.61,104,185.1,61.5,209.3,281.10000000000002,114,256.5,276,83,927.6,72.400000000000006,3.2,9.4,6.6,0,0,65,85,93,32,60,77,90,0,0,null,150,"Tournesol, tourteau de presse, partiel. décortiqué",1000,6.57,6.61,104,185.1,61.5,209.3,281.10000000000002,114,256.5,276,83,927.6,72.400000000000006,3.2,9.4,6.6,16,null,65,85,93,32,60,77,90,0,0,24,"Weizenstärke",1000,8.7799999999999994,9.9600000000000009,73.2,18.100000000000001,101.7,17.600000000000001,26.4,4.2,4.5999999999999996,958,0,993.2,6.8,0,0,0,0,0,94,60,60,30,95,70,90,879.1,75]
[151,null,"Tournesol, tourteau de pression non décortiqué",1000,4.8499999999999996,4.3899999999999997,78.2,154.4,38,174.6,234.4,112.8,407.4,198.3,0,952.9,47.1,0,0,0,0,0,45,83,92,15,35,77,90,0,0,null,151,"Tournesol, tourteau de pression non décortiqué",1000,4.8499999999999996,4.3899999999999997,78.2,154.4,38,174.6,234.4,112.8,407.4,198.3,null,952.9,47.1,null,null,null,null,null,45,83,92,15,35,77,90,0,0,155,"Wicke, Samen",1000,8.08,8.7899999999999991,144.4,188.9,109.2,198.8,298,14,69,581,46,962,38,1.6,5,1.8,10,0,89,87,86,59,94,70,75,0,0]
[152,null,"Tournesol, tourteau d'extraction, non décortiqué",1000,4.12,3.64,97.7,167.9,61,189.9,255,15,370,310,50,950,50,4.8,8.5,5,0,0,52,84,68,30,50,77,90,0,0,null,152,"Tournesol, tourteau d'extraction, non décortiqué",1000,4.12,3.64,97.7,167.9,61,189.9,255,15,370,310,50,950,50,4.8,8.5,5,13,null,52,84,68,30,50,77,90,0,0,57,"Zichorienwurzeln frisch",1000,7.16,7.81,78.8,51.8,108,73.3,88,18,108,688,131,902,98,5,2.6,1.3,20,0,86,71,60,77,90,85,65,0,0]
[153,null,"Tournesol, tourteau d'extraction, partiel. décortiqué",1000,4.92,4.6399999999999997,119.9,217.8,68.5,246.3,330.7,20.7,271.39999999999998,295.39999999999998,77,918.2,81.8,3.9,9.4,5.2,0,0,62,85,70,32,60,77,90,0,0,null,153,"Tournesol, tourteau d'extraction, partiel. décortiqué",1000,4.92,4.6399999999999997,119.9,217.8,68.5,246.3,330.7,20.7,271.39999999999998,295.39999999999998,77,918.2,81.8,3.9,9.4,5.2,15,null,62,85,70,32,60,77,90,0,0,1,"Zitrustrester getrocknet",1000,7.55,8.23,90.9,47.7,106.9,44,72,34,140,691,241,937,63,18.899999999999999,1.3,1.5,9,0,85,50,80,80,90,65,80,69.099999999999994,0]
[154,null,"Triticale, grain ",1000,8.31,9.23,104.4,78.599999999999994,121.6,90.6,121.7,15.6,25,818,42,980.3,19.7,0.6,4.3,1.1000000000000001,0,0,90,75,72,33,94,77,85,681.2,95,null,154,"Triticale, grain ",1000,8.31,9.23,104.4,78.599999999999994,121.6,90.6,121.7,15.6,25,818,42,980.3,19.7,0.6,4.3,1.1000000000000001,5,null,90,75,72,33,94,77,85,681.2,95,18,"Zuckerrübe frisch",1000,7.71,8.58,84.4,33.1,119.8,44.3,57,2,47,827,676,933,67,2.1,1.5,1.3,9,0,90,55,30,75,93,80,60,0,0]
[155,null,"Vesce, graine ",1000,8.08,8.7899999999999991,144.4,188.9,109.2,198.8,298,14,69,581,46,962,38,1.6,5,1.8,0,0,89,87,86,59,94,70,75,0,0,null,155,"Vesce, graine ",1000,8.08,8.7899999999999991,144.4,188.9,109.2,198.8,298,14,69,581,46,962,38,1.6,5,1.8,10,null,89,87,86,59,94,70,75,0,0,95,"Zuckerrübenmelasse",1000,7.6,8.5,76,74,118,128,128,0,0,757,625,885,115,1.5,0.1,0.2,40,0,92,75,0,0,95,100,0,0,0]
[156,null,"Viande 60 % MA, farine ",1000,7.4,7.7,216,391,47,358,643,89,29,32,0,793,207,61.7,32.200000000000003,1.6,0,0,85,89,86,30,50,60,65,0,0,null,156,"Viande 60 % MA, farine ",1000,7.4,7.7,216,391,47,358,643,89,29,32,0,793,207,61.7,32.200000000000003,1.6,6,null,85,89,86,30,50,60,65,0,0,20,"Zuckerrübenschnitzel getrocknet",1000,7.24,7.82,109.8,63.2,108.7,40.200000000000003,90.2,8.5,206,640.5,66,945.2,54.8,7.8,1,2.1,7,0,85,60,30,80,92,50,80,0,0]
[157,null,"Viande et os 40 % MA, farine",1000,5.0999999999999996,5.3,148,278,26,254,457,84,9,12,0,562,438,149.80000000000001,73.099999999999994,2.2999999999999998,0,0,79,80,86,30,40,60,65,0,0,null,157,"Viande et os 40 % MA, farine",1000,5.0999999999999996,5.3,148,278,26,254,457,84,9,12,0,562,438,149.80000000000001,73.099999999999994,2.2999999999999998,8,null,79,80,86,30,40,60,65,0,0,19,"Zuckerrübenschnitzel siliert",1000,7.17,7.71,105.6,66.3,106.2,50.1,100.1,10,211.8,621.1,18,943,57,7.5,1.2,2.6,7,95,85,60,30,80,92,55,75,0,0]
[]
[]
[]
[null,null,null,null,null,null,null,null,null,null,null,null,null,null,null,null,null,null,null,null,null,null,null,null,null,null,null,null,null,null,null,null,null,null,null,null,null,null,null,null,null,"MG","MA"]
[null,null,null,null,null,null,null,null,null,null,null,null,null,null,null,null,null,null,null,null,null,null,null,null,null,null,null,null,null,null,null,null,null,null,null,null,null,null,null,null,null,4.2,26.4]
[null,null,null,null,null,null,null,null,null,null,null,null,null,null,null,null,null,null,null,null,null,null,null,null,null,null,null,null,null,null,null,null,null,null,null,null,null,null,null,null,null,1,19]
[null,null,null,null,null,null,null,null,null,null,null,null,null,null,null,null,null,null,null,null,null,null,null,null,null,null,null,null,null,null,null,null,null,null,null,null,null,null,null,null,null,78,552.29999999999995]
[null,null,null,null,null,null,null,null,null,null,null,null,null,null,null,null,null,null,null,null,null,null,null,null,null,null,null,null,null,null,null,null,null,null,null,null,null,null,null,null,null,77,542]
[null,null,null,null,null,null,null,null,null,null,null,null,null,null,null,null,null,null,null,null,null,null,null,null,null,null,null,null,null,null,null,null,null,null,null,null,null,null,null,null,null,22,575]
[null,null,null,null,null,null,null,null,null,null,null,null,null,null,null,null,null,null,null,null,null,null,null,null,null,null,null,null,null,null,null,null,null,null,null,null,null,null,null,null,null,54.1,129]
[null,null,null,null,null,null,null,null,null,null,null,null,null,null,null,null,null,null,null,null,null,null,null,null,null,null,null,null,null,null,null,null,null,null,null,null,null,null,null,null,null,27,126.2]
[null,null,null,null,null,null,null,null,null,null,null,null,null,null,null,null,null,null,null,null,null,null,null,null,null,null,null,null,null,null,null,null,null,null,null,null,null,null,null,null,null,30.4,90.9]
[null,null,null,null,null,null,null,null,null,null,null,null,null,null,null,null,null,null,null,null,null,null,null,null,null,null,null,null,null,null,null,null,null,null,null,null,null,null,null,null,null,76,146]
[null,null,null,null,null,null,null,null,null,null,null,null,null,null,null,null,null,null,null,null,null,null,null,null,null,null,null,null,null,null,null,null,null,null,null,null,null,null,null,null,null,70.5,151.4]
[null,null,null,null,null,null,null,null,null,null,null,null,null,null,null,null,null,null,null,null,null,null,null,null,null,null,null,null,null,null,null,null,null,null,null,null,null,null,null,null,null,50.4,119.4]
[null,null,null,null,null,null,null,null,null,null,null,null,null,null,null,null,null,null,null,null,null,null,null,null,null,null,null,null,null,null,null,null,null,null,null,null,null,null,null,null,null,54.3,134.5]
[null,null,null,null,null,null,null,null,null,null,null,null,null,null,null,null,null,null,null,null,null,null,null,null,null,null,null,null,null,null,null,null,null,null,null,null,null,null,null,null,null,42,111]
[null,null,null,null,null,null,null,null,null,null,null,null,null,null,null,null,null,null,null,null,null,null,null,null,null,null,null,null,null,null,null,null,null,null,null,null,null,null,null,null,null,47,112]
[null,null,null,null,null,null,null,null,null,null,null,null,null,null,null,null,null,null,null,null,null,null,null,null,null,null,null,null,null,null,null,null,null,null,null,null,null,null,null,null,null,60.1,310.2]
[null,null,null,null,null,null,null,null,null,null,null,null,null,null,null,null,null,null,null,null,null,null,null,null,null,null,null,null,null,null,null,null,null,null,null,null,null,null,null,null,null,60.1,310.2]
[null,null,null,null,null,null,null,null,null,null,null,null,null,null,null,null,null,null,null,null,null,null,null,null,null,null,null,null,null,null,null,null,null,null,null,null,null,null,null,null,null,3.7,70]
[null,null,null,null,null,null,null,null,null,null,null,null,null,null,null,null,null,null,null,null,null,null,null,null,null,null,null,null,null,null,null,null,null,null,null,null,null,null,null,null,null,2,57]
[null,null,null,null,null,null,null,null,null,null,null,null,null,null,null,null,null,null,null,null,null,null,null,null,null,null,null,null,null,null,null,null,null,null,null,null,null,null,null,null,null,10,100.1]
[null,null,null,null,null,null,null,null,null,null,null,null,null,null,null,null,null,null,null,null,null,null,null,null,null,null,null,null,null,null,null,null,null,null,null,null,null,null,null,null,null,8.5,90.2]
[null,null,null,null,null,null,null,null,null,null,null,null,null,null,null,null,null,null,null,null,null,null,null,null,null,null,null,null,null,null,null,null,null,null,null,null,null,null,null,null,null,15.7,135.6]
[null,null,null,null,null,null,null,null,null,null,null,null,null,null,null,null,null,null,null,null,null,null,null,null,null,null,null,null,null,null,null,null,null,null,null,null,null,null,null,null,null,16.600000000000001,147.69999999999999]
[null,null,null,null,null,null,null,null,null,null,null,null,null,null,null,null,null,null,null,null,null,null,null,null,null,null,null,null,null,null,null,null,null,null,null,null,null,null,null,null,null,19.5,155.19999999999999]
[null,null,null,null,null,null,null,null,null,null,null,null,null,null,null,null,null,null,null,null,null,null,null,null,null,null,null,null,null,null,null,null,null,null,null,null,null,null,null,null,null,30.6,188.5]
[null,null,null,null,null,null,null,null,null,null,null,null,null,null,null,null,null,null,null,null,null,null,null,null,null,null,null,null,null,null,null,null,null,null,null,null,null,null,null,null,null,50.6,186.2]
[null,null,null,null,null,null,null,null,null,null,null,null,null,null,null,null,null,null,null,null,null,null,null,null,null,null,null,null,null,null,null,null,null,null,null,null,null,null,null,null,null,101,320]
[null,null,null,null,null,null,null,null,null,null,null,null,null,null,null,null,null,null,null,null,null,null,null,null,null,null,null,null,null,null,null,null,null,null,null,null,null,null,null,null,null,26.9,860.6]
[null,null,null,null,null,null,null,null,null,null,null,null,null,null,null,null,null,null,null,null,null,null,null,null,null,null,null,null,null,null,null,null,null,null,null,null,null,null,null,null,null,16.3,155.69999999999999]
[null,null,null,null,null,null,null,null,null,null,null,null,null,null,null,null,null,null,null,null,null,null,null,null,null,null,null,null,null,null,null,null,null,null,null,null,null,null,null,null,null,45.8,193.6]
[null,null,null,null,null,null,null,null,null,null,null,null,null,null,null,null,null,null,null,null,null,null,null,null,null,null,null,null,null,null,null,null,null,null,null,null,null,null,null,null,null,45.4,178.8]
[null,null,null,null,null,null,null,null,null,null,null,null,null,null,null,null,null,null,null,null,null,null,null,null,null,null,null,null,null,null,null,null,null,null,null,null,null,null,null,null,null,26,150]
[null,null,null,null,null,null,null,null,null,null,null,null,null,null,null,null,null,null,null,null,null,null,null,null,null,null,null,null,null,null,null,null,null,null,null,null,null,null,null,null,null,51,177]
[null,null,null,null,null,null,null,null,null,null,null,null,null,null,null,null,null,null,null,null,null,null,null,null,null,null,null,null,null,null,null,null,null,null,null,null,null,null,null,null,null,211.2,123.7]
[null,null,null,null,null,null,null,null,null,null,null,null,null,null,null,null,null,null,null,null,null,null,null,null,null,null,null,null,null,null,null,null,null,null,null,null,null,null,null,null,null,17,139]
[null,null,null,null,null,null,null,null,null,null,null,null,null,null,null,null,null,null,null,null,null,null,null,null,null,null,null,null,null,null,null,null,null,null,null,null,null,null,null,null,null,15,96]
[null,null,null,null,null,null,null,null,null,null,null,null,null,null,null,null,null,null,null,null,null,null,null,null,null,null,null,null,null,null,null,null,null,null,null,null,null,null,null,null,null,10,68.5]
[null,null,null,null,null,null,null,null,null,null,null,null,null,null,null,null,null,null,null,null,null,null,null,null,null,null,null,null,null,null,null,null,null,null,null,null,null,null,null,null,null,14,914]
[null,null,null,null,null,null,null,null,null,null,null,null,null,null,null,null,null,null,null,null,null,null,null,null,null,null,null,null,null,null,null,null,null,null,null,null,null,null,null,null,null,12,118]
[null,null,null,null,null,null,null,null,null,null,null,null,null,null,null,null,null,null,null,null,null,null,null,null,null,null,null,null,null,null,null,null,null,null,null,null,null,null,null,null,null,475.4,207.2]
[null,null,null,null,null,null,null,null,null,null,null,null,null,null,null,null,null,null,null,null,null,null,null,null,null,null,null,null,null,null,null,null,null,null,null,null,null,null,null,null,null,75,363]
[null,null,null,null,null,null,null,null,null,null,null,null,null,null,null,null,null,null,null,null,null,null,null,null,null,null,null,null,null,null,null,null,null,null,null,null,null,null,null,null,null,108,350]
[null,null,null,null,null,null,null,null,null,null,null,null,null,null,null,null,null,null,null,null,null,null,null,null,null,null,null,null,null,null,null,null,null,null,null,null,null,null,null,null,null,140,320]
[null,null,null,null,null,null,null,null,null,null,null,null,null,null,null,null,null,null,null,null,null,null,null,null,null,null,null,null,null,null,null,null,null,null,null,null,null,null,null,null,null,18,385]
[null,null,null,null,null,null,null,null,null,null,null,null,null,null,null,null,null,null,null,null,null,null,null,null,null,null,null,null,null,null,null,null,null,null,null,null,null,null,null,null,null,27,238]
[null,null,null,null,null,null,null,null,null,null,null,null,null,null,null,null,null,null,null,null,null,null,null,null,null,null,null,null,null,null,null,null,null,null,null,null,null,null,null,null,null,220,233]
[null,null,null,null,null,null,null,null,null,null,null,null,null,null,null,null,null,null,null,null,null,null,null,null,null,null,null,null,null,null,null,null,null,null,null,null,null,null,null,null,null,13,304]
[null,null,null,null,null,null,null,null,null,null,null,null,null,null,null,null,null,null,null,null,null,null,null,null,null,null,null,null,null,null,null,null,null,null,null,null,null,null,null,null,null,16,446]
[null,null,null,null,null,null,null,null,null,null,null,null,null,null,null,null,null,null,null,null,null,null,null,null,null,null,null,null,null,null,null,null,null,null,null,null,null,null,null,null,null,99,864]
[null,null,null,null,null,null,null,null,null,null,null,null,null,null,null,null,null,null,null,null,null,null,null,null,null,null,null,null,null,null,null,null,null,null,null,null,null,null,null,null,null,97.1,251.2]
[null,null,null,null,null,null,null,null,null,null,null,null,null,null,null,null,null,null,null,null,null,null,null,null,null,null,null,null,null,null,null,null,null,null,null,null,null,null,null,null,null,87.1,261.8]
[null,null,null,null,null,null,null,null,null,null,null,null,null,null,null,null,null,null,null,null,null,null,null,null,null,null,null,null,null,null,null,null,null,null,null,null,null,null,null,null,null,104,255.4]
[null,null,null,null,null,null,null,null,null,null,null,null,null,null,null,null,null,null,null,null,null,null,null,null,null,null,null,null,null,null,null,null,null,null,null,null,null,null,null,null,null,18,88]
[null,null,null,null,null,null,null,null,null,null,null,null,null,null,null,null,null,null,null,null,null,null,null,null,null,null,null,null,null,null,null,null,null,null,null,null,null,null,null,null,null,19.8,136.69999999999999]
[null,null,null,null,null,null,null,null,null,null,null,null,null,null,null,null,null,null,null,null,null,null,null,null,null,null,null,null,null,null,null,null,null,null,null,null,null,null,null,null,null,17.8,296]
[null,null,null,null,null,null,null,null,null,null,null,null,null,null,null,null,null,null,null,null,null,null,null,null,null,null,null,null,null,null,null,null,null,null,null,null,null,null,null,null,null,350.9,189.1]
[null,null,null,null,null,null,null,null,null,null,null,null,null,null,null,null,null,null,null,null,null,null,null,null,null,null,null,null,null,null,null,null,null,null,null,null,null,null,null,null,null,518,148.1]
[null,null,null,null,null,null,null,null,null,null,null,null,null,null,null,null,null,null,null,null,null,null,null,null,null,null,null,null,null,null,null,null,null,null,null,null,null,null,null,null,null,497.5,142.80000000000001]
[null,null,null,null,null,null,null,null,null,null,null,null,null,null,null,null,null,null,null,null,null,null,null,null,null,null,null,null,null,null,null,null,null,null,null,null,null,null,null,null,null,17,257]
[null,null,null,null,null,null,null,null,null,null,null,null,null,null,null,null,null,null,null,null,null,null,null,null,null,null,null,null,null,null,null,null,null,null,null,null,null,null,null,null,null,5.9,129.6]
[null,null,null,null,null,null,null,null,null,null,null,null,null,null,null,null,null,null,null,null,null,null,null,null,null,null,null,null,null,null,null,null,null,null,null,null,null,null,null,null,null,5.9,129.6]
[null,null,null,null,null,null,null,null,null,null,null,null,null,null,null,null,null,null,null,null,null,null,null,null,null,null,null,null,null,null,null,null,null,null,null,null,null,null,null,null,null,5.9,129.6]
[null,null,null,null,null,null,null,null,null,null,null,null,null,null,null,null,null,null,null,null,null,null,null,null,null,null,null,null,null,null,null,null,null,null,null,null,null,null,null,null,null,7.2,128.9]
[null,null,null,null,null,null,null,null,null,null,null,null,null,null,null,null,null,null,null,null,null,null,null,null,null,null,null,null,null,null,null,null,null,null,null,null,null,null,null,null,null,10,127]
[null,null,null,null,null,null,null,null,null,null,null,null,null,null,null,null,null,null,null,null,null,null,null,null,null,null,null,null,null,null,null,null,null,null,null,null,null,null,null,null,null,8.1999999999999993,359.7]
[null,null,null,null,null,null,null,null,null,null,null,null,null,null,null,null,null,null,null,null,null,null,null,null,null,null,null,null,null,null,null,null,null,null,null,null,null,null,null,null,null,8.1999999999999993,359.7]
[null,null,null,null,null,null,null,null,null,null,null,null,null,null,null,null,null,null,null,null,null,null,null,null,null,null,null,null,null,null,null,null,null,null,null,null,null,null,null,null,null,333,244.2]
[null,null,null,null,null,null,null,null,null,null,null,null,null,null,null,null,null,null,null,null,null,null,null,null,null,null,null,null,null,null,null,null,null,null,null,null,null,null,null,null,null,250,265]
[null,null,null,null,null,null,null,null,null,null,null,null,null,null,null,null,null,null,null,null,null,null,null,null,null,null,null,null,null,null,null,null,null,null,null,null,null,null,null,null,null,28.1,495]
[null,null,null,null,null,null,null,null,null,null,null,null,null,null,null,null,null,null,null,null,null,null,null,null,null,null,null,null,null,null,null,null,null,null,null,null,null,null,null,null,null,41.2,532.20000000000005]
[null,null,null,null,null,null,null,null,null,null,null,null,null,null,null,null,null,null,null,null,null,null,null,null,null,null,null,null,null,null,null,null,null,null,null,null,null,null,null,null,null,430.8,225.4]
[null,null,null,null,null,null,null,null,null,null,null,null,null,null,null,null,null,null,null,null,null,null,null,null,null,null,null,null,null,null,null,null,null,null,null,null,null,null,null,null,null,134.30000000000001,338.1]
[null,null,null,null,null,null,null,null,null,null,null,null,null,null,null,null,null,null,null,null,null,null,null,null,null,null,null,null,null,null,null,null,null,null,null,null,null,null,null,null,null,65,365]
[null,null,null,null,null,null,null,null,null,null,null,null,null,null,null,null,null,null,null,null,null,null,null,null,null,null,null,null,null,null,null,null,null,null,null,null,null,null,null,null,null,107.8,337.5]
[null,null,null,null,null,null,null,null,null,null,null,null,null,null,null,null,null,null,null,null,null,null,null,null,null,null,null,null,null,null,null,null,null,null,null,null,null,null,null,null,null,38.799999999999997,327.60000000000002]
[null,null,null,null,null,null,null,null,null,null,null,null,null,null,null,null,null,null,null,null,null,null,null,null,null,null,null,null,null,null,null,null,null,null,null,null,null,null,null,null,null,95,396]
[null,null,null,null,null,null,null,null,null,null,null,null,null,null,null,null,null,null,null,null,null,null,null,null,null,null,null,null,null,null,null,null,null,null,null,null,null,null,null,null,null,67.3,358.7]
[null,null,null,null,null,null,null,null,null,null,null,null,null,null,null,null,null,null,null,null,null,null,null,null,null,null,null,null,null,null,null,null,null,null,null,null,null,null,null,null,null,55.7,671.8]
[null,null,null,null,null,null,null,null,null,null,null,null,null,null,null,null,null,null,null,null,null,null,null,null,null,null,null,null,null,null,null,null,null,null,null,null,null,null,null,null,null,74.2,774.2]
[null,null,null,null,null,null,null,null,null,null,null,null,null,null,null,null,null,null,null,null,null,null,null,null,null,null,null,null,null,null,null,null,null,null,null,null,null,null,null,null,null,26,232]
[null,null,null,null,null,null,null,null,null,null,null,null,null,null,null,null,null,null,null,null,null,null,null,null,null,null,null,null,null,null,null,null,null,null,null,null,null,null,null,null,null,75,116]
[null,null,null,null,null,null,null,null,null,null,null,null,null,null,null,null,null,null,null,null,null,null,null,null,null,null,null,null,null,null,null,null,null,null,null,null,null,null,null,null,null,211.8,142]
[null,null,null,null,null,null,null,null,null,null,null,null,null,null,null,null,null,null,null,null,null,null,null,null,null,null,null,null,null,null,null,null,null,null,null,null,null,null,null,null,null,47.2,96.3]
[null,null,null,null,null,null,null,null,null,null,null,null,null,null,null,null,null,null,null,null,null,null,null,null,null,null,null,null,null,null,null,null,null,null,null,null,null,null,null,null,null,35,83]
[null,null,null,null,null,null,null,null,null,null,null,null,null,null,null,null,null,null,null,null,null,null,null,null,null,null,null,null,null,null,null,null,null,null,null,null,null,null,null,null,null,46.7,94.7]
[null,null,null,null,null,null,null,null,null,null,null,null,null,null,null,null,null,null,null,null,null,null,null,null,null,null,null,null,null,null,null,null,null,null,null,null,null,null,null,null,null,36,83]
[null,null,null,null,null,null,null,null,null,null,null,null,null,null,null,null,null,null,null,null,null,null,null,null,null,null,null,null,null,null,null,null,null,null,null,null,null,null,null,null,null,44.4,91.4]
[null,null,null,null,null,null,null,null,null,null,null,null,null,null,null,null,null,null,null,null,null,null,null,null,null,null,null,null,null,null,null,null,null,null,null,null,null,null,null,null,null,16,282]
[null,null,null,null,null,null,null,null,null,null,null,null,null,null,null,null,null,null,null,null,null,null,null,null,null,null,null,null,null,null,null,null,null,null,null,null,null,null,null,null,null,3,23]
[null,null,null,null,null,null,null,null,null,null,null,null,null,null,null,null,null,null,null,null,null,null,null,null,null,null,null,null,null,null,null,null,null,null,null,null,null,null,null,null,null,13.5,44.6]
[null,null,null,null,null,null,null,null,null,null,null,null,null,null,null,null,null,null,null,null,null,null,null,null,null,null,null,null,null,null,null,null,null,null,null,null,null,null,null,null,null,37.1,81.3]
[null,null,null,null,null,null,null,null,null,null,null,null,null,null,null,null,null,null,null,null,null,null,null,null,null,null,null,null,null,null,null,null,null,null,null,null,null,null,null,null,null,22.3,49.5]
[null,null,null,null,null,null,null,null,null,null,null,null,null,null,null,null,null,null,null,null,null,null,null,null,null,null,null,null,null,null,null,null,null,null,null,null,null,null,null,null,null,73,132]
[null,null,null,null,null,null,null,null,null,null,null,null,null,null,null,null,null,null,null,null,null,null,null,null,null,null,null,null,null,null,null,null,null,null,null,null,null,null,null,null,null,0,128]
[null,null,null,null,null,null,null,null,null,null,null,null,null,null,null,null,null,null,null,null,null,null,null,null,null,null,null,null,null,null,null,null,null,null,null,null,null,null,null,null,null,29,102]
[null,null,null,null,null,null,null,null,null,null,null,null,null,null,null,null,null,null,null,null,null,null,null,null,null,null,null,null,null,null,null,null,null,null,null,null,null,null,null,null,null,43.9,124.2]
[null,null,null,null,null,null,null,null,null,null,null,null,null,null,null,null,null,null,null,null,null,null,null,null,null,null,null,null,null,null,null,null,null,null,null,null,null,null,null,null,null,37,113]
[null,null,null,null,null,null,null,null,null,null,null,null,null,null,null,null,null,null,null,null,null,null,null,null,null,null,null,null,null,null,null,null,null,null,null,null,null,null,null,null,null,278,344]
[null,null,null,null,null,null,null,null,null,null,null,null,null,null,null,null,null,null,null,null,null,null,null,null,null,null,null,null,null,null,null,null,null,null,null,null,null,null,null,null,null,30.3,130.80000000000001]
[null,null,null,null,null,null,null,null,null,null,null,null,null,null,null,null,null,null,null,null,null,null,null,null,null,null,null,null,null,null,null,null,null,null,null,null,null,null,null,null,null,13.2,115.2]
[null,null,null,null,null,null,null,null,null,null,null,null,null,null,null,null,null,null,null,null,null,null,null,null,null,null,null,null,null,null,null,null,null,null,null,null,null,null,null,null,null,24.6,118.8]
[null,null,null,null,null,null,null,null,null,null,null,null,null,null,null,null,null,null,null,null,null,null,null,null,null,null,null,null,null,null,null,null,null,null,null,null,null,null,null,null,null,26.4,140.5]
[null,null,null,null,null,null,null,null,null,null,null,null,null,null,null,null,null,null,null,null,null,null,null,null,null,null,null,null,null,null,null,null,null,null,null,null,null,null,null,null,null,26.2,116.3]
[null,null,null,null,null,null,null,null,null,null,null,null,null,null,null,null,null,null,null,null,null,null,null,null,null,null,null,null,null,null,null,null,null,null,null,null,null,null,null,null,null,41.6,128.69999999999999]
[null,null,null,null,null,null,null,null,null,null,null,null,null,null,null,null,null,null,null,null,null,null,null,null,null,null,null,null,null,null,null,null,null,null,null,null,null,null,null,null,null,21,197]
[null,null,null,null,null,null,null,null,null,null,null,null,null,null,null,null,null,null,null,null,null,null,null,null,null,null,null,null,null,null,null,null,null,null,null,null,null,null,null,null,null,10,139.6]
[null,null,null,null,null,null,null,null,null,null,null,null,null,null,null,null,null,null,null,null,null,null,null,null,null,null,null,null,null,null,null,null,null,null,null,null,null,null,null,null,null,22.4,173.3]
[null,null,null,null,null,null,null,null,null,null,null,null,null,null,null,null,null,null,null,null,null,null,null,null,null,null,null,null,null,null,null,null,null,null,null,null,null,null,null,null,null,1.4,169.1]
[null,null,null,null,null,null,null,null,null,null,null,null,null,null,null,null,null,null,null,null,null,null,null,null,null,null,null,null,null,null,null,null,null,null,null,null,null,null,null,null,null,67,885]
[null,null,null,null,null,null,null,null,null,null,null,null,null,null,null,null,null,null,null,null,null,null,null,null,null,null,null,null,null,null,null,null,null,null,null,null,null,null,null,null,null,11,19]
[null,null,null,null,null,null,null,null,null,null,null,null,null,null,null,null,null,null,null,null,null,null,null,null,null,null,null,null,null,null,null,null,null,null,null,null,null,null,null,null,null,19.100000000000001,227.6]
[null,null,null,null,null,null,null,null,null,null,null,null,null,null,null,null,null,null,null,null,null,null,null,null,null,null,null,null,null,null,null,null,null,null,null,null,null,null,null,null,null,103,690]
[null,null,null,null,null,null,null,null,null,null,null,null,null,null,null,null,null,null,null,null,null,null,null,null,null,null,null,null,null,null,null,null,null,null,null,null,null,null,null,null,null,108.6,766.7]
[null,null,null,null,null,null,null,null,null,null,null,null,null,null,null,null,null,null,null,null,null,null,null,null,null,null,null,null,null,null,null,null,null,null,null,null,null,null,null,null,null,4,93.7]
[null,null,null,null,null,null,null,null,null,null,null,null,null,null,null,null,null,null,null,null,null,null,null,null,null,null,null,null,null,null,null,null,null,null,null,null,null,null,null,null,null,3,91]
[null,null,null,null,null,null,null,null,null,null,null,null,null,null,null,null,null,null,null,null,null,null,null,null,null,null,null,null,null,null,null,null,null,null,null,null,null,null,null,null,null,19,23]
[null,null,null,null,null,null,null,null,null,null,null,null,null,null,null,null,null,null,null,null,null,null,null,null,null,null,null,null,null,null,null,null,null,null,null,null,null,null,null,null,null,1.5,2]
[null,null,null,null,null,null,null,null,null,null,null,null,null,null,null,null,null,null,null,null,null,null,null,null,null,null,null,null,null,null,null,null,null,null,null,null,null,null,null,null,null,2.6,89.7]
[null,null,null,null,null,null,null,null,null,null,null,null,null,null,null,null,null,null,null,null,null,null,null,null,null,null,null,null,null,null,null,null,null,null,null,null,null,null,null,null,null,2.7,90.4]
[null,null,null,null,null,null,null,null,null,null,null,null,null,null,null,null,null,null,null,null,null,null,null,null,null,null,null,null,null,null,null,null,null,null,null,null,null,null,null,null,null,24.7,833.5]
[null,null,null,null,null,null,null,null,null,null,null,null,null,null,null,null,null,null,null,null,null,null,null,null,null,null,null,null,null,null,null,null,null,null,null,null,null,null,null,null,null,14.3,943.3]
[null,null,null,null,null,null,null,null,null,null,null,null,null,null,null,null,null,null,null,null,null,null,null,null,null,null,null,null,null,null,null,null,null,null,null,null,null,null,null,null,null,8.8000000000000007,943.1]
[null,null,null,null,null,null,null,null,null,null,null,null,null,null,null,null,null,null,null,null,null,null,null,null,null,null,null,null,null,null,null,null,null,null,null,null,null,null,null,null,null,75.599999999999994,734.4]
[null,null,null,null,null,null,null,null,null,null,null,null,null,null,null,null,null,null,null,null,null,null,null,null,null,null,null,null,null,null,null,null,null,null,null,null,null,null,null,null,null,34,72]
[null,null,null,null,null,null,null,null,null,null,null,null,null,null,null,null,null,null,null,null,null,null,null,null,null,null,null,null,null,null,null,null,null,null,null,null,null,null,null,null,null,15,133]
[null,null,null,null,null,null,null,null,null,null,null,null,null,null,null,null,null,null,null,null,null,null,null,null,null,null,null,null,null,null,null,null,null,null,null,null,null,null,null,null,null,7.5,151.30000000000001]
[null,null,null,null,null,null,null,null,null,null,null,null,null,null,null,null,null,null,null,null,null,null,null,null,null,null,null,null,null,null,null,null,null,null,null,null,null,null,null,null,null,8.3000000000000007,166.2]
[null,null,null,null,null,null,null,null,null,null,null,null,null,null,null,null,null,null,null,null,null,null,null,null,null,null,null,null,null,null,null,null,null,null,null,null,null,null,null,null,null,13,78.400000000000006]
[null,null,null,null,null,null,null,null,null,null,null,null,null,null,null,null,null,null,null,null,null,null,null,null,null,null,null,null,null,null,null,null,null,null,null,null,null,null,null,null,null,9.9,88]
[null,null,null,null,null,null,null,null,null,null,null,null,null,null,null,null,null,null,null,null,null,null,null,null,null,null,null,null,null,null,null,null,null,null,null,null,null,null,null,null,null,145,144]
[null,null,null,null,null,null,null,null,null,null,null,null,null,null,null,null,null,null,null,null,null,null,null,null,null,null,null,null,null,null,null,null,null,null,null,null,null,null,null,null,null,189,166]
[null,null,null,null,null,null,null,null,null,null,null,null,null,null,null,null,null,null,null,null,null,null,null,null,null,null,null,null,null,null,null,null,null,null,null,null,null,null,null,null,null,6.5,952.5]
[null,null,null,null,null,null,null,null,null,null,null,null,null,null,null,null,null,null,null,null,null,null,null,null,null,null,null,null,null,null,null,null,null,null,null,null,null,null,null,null,null,13.4,113]
[null,null,null,null,null,null,null,null,null,null,null,null,null,null,null,null,null,null,null,null,null,null,null,null,null,null,null,null,null,null,null,null,null,null,null,null,null,null,null,null,null,24,130]
[null,null,null,null,null,null,null,null,null,null,null,null,null,null,null,null,null,null,null,null,null,null,null,null,null,null,null,null,null,null,null,null,null,null,null,null,null,null,null,null,null,196,407]
[null,null,null,null,null,null,null,null,null,null,null,null,null,null,null,null,null,null,null,null,null,null,null,null,null,null,null,null,null,null,null,null,null,null,null,null,null,null,null,null,null,210.6,410.7]
[null,null,null,null,null,null,null,null,null,null,null,null,null,null,null,null,null,null,null,null,null,null,null,null,null,null,null,null,null,null,null,null,null,null,null,null,null,null,null,null,null,71,473]
[null,null,null,null,null,null,null,null,null,null,null,null,null,null,null,null,null,null,null,null,null,null,null,null,null,null,null,null,null,null,null,null,null,null,null,null,null,null,null,null,null,20,499]
[null,null,null,null,null,null,null,null,null,null,null,null,null,null,null,null,null,null,null,null,null,null,null,null,null,null,null,null,null,null,null,null,null,null,null,null,null,null,null,null,null,17,539]
[null,null,null,null,null,null,null,null,null,null,null,null,null,null,null,null,null,null,null,null,null,null,null,null,null,null,null,null,null,null,null,null,null,null,null,null,null,null,null,null,null,43,177]
[null,null,null,null,null,null,null,null,null,null,null,null,null,null,null,null,null,null,null,null,null,null,null,null,null,null,null,null,null,null,null,null,null,null,null,null,null,null,null,null,null,325,197]
[null,null,null,null,null,null,null,null,null,null,null,null,null,null,null,null,null,null,null,null,null,null,null,null,null,null,null,null,null,null,null,null,null,null,null,null,null,null,null,null,null,114,281.10000000000002]
[null,null,null,null,null,null,null,null,null,null,null,null,null,null,null,null,null,null,null,null,null,null,null,null,null,null,null,null,null,null,null,null,null,null,null,null,null,null,null,null,null,15,255]
[null,null,null,null,null,null,null,null,null,null,null,null,null,null,null,null,null,null,null,null,null,null,null,null,null,null,null,null,null,null,null,null,null,null,null,null,null,null,null,null,null,20.7,330.7]
[null,null,null,null,null,null,null,null,null,null,null,null,null,null,null,null,null,null,null,null,null,null,null,null,null,null,null,null,null,null,null,null,null,null,null,null,null,null,null,null,null,177.9,328.5]
[null,null,null,null,null,null,null,null,null,null,null,null,null,null,null,null,null,null,null,null,null,null,null,null,null,null,null,null,null,null,null,null,null,null,null,null,null,null,null,null,null,100.7,352.6]
[null,null,null,null,null,null,null,null,null,null,null,null,null,null,null,null,null,null,null,null,null,null,null,null,null,null,null,null,null,null,null,null,null,null,null,null,null,null,null,null,null,112.8,234.4]
[null,null,null,null,null,null,null,null,null,null,null,null,null,null,null,null,null,null,null,null,null,null,null,null,null,null,null,null,null,null,null,null,null,null,null,null,null,null,null,null,null,38.200000000000003,366.5]
[null,null,null,null,null,null,null,null,null,null,null,null,null,null,null,null,null,null,null,null,null,null,null,null,null,null,null,null,null,null,null,null,null,null,null,null,null,null,null,null,null,23.8,388.6]
[null,null,null,null,null,null,null,null,null,null,null,null,null,null,null,null,null,null,null,null,null,null,null,null,null,null,null,null,null,null,null,null,null,null,null,null,null,null,null,null,null,16.87,550.82000000000005]
[null,null,null,null,null,null,null,null,null,null,null,null,null,null,null,null,null,null,null,null,null,null,null,null,null,null,null,null,null,null,null,null,null,null,null,null,null,null,null,null,null,12.3,506.8]
[null,null,null,null,null,null,null,null,null,null,null,null,null,null,null,null,null,null,null,null,null,null,null,null,null,null,null,null,null,null,null,null,null,null,null,null,null,null,null,null,null,42.2,509.5]
[null,null,null,null,null,null,null,null,null,null,null,null,null,null,null,null,null,null,null,null,null,null,null,null,null,null,null,null,null,null,null,null,null,null,null,null,null,null,null,null,null,23,505.2]
[null,null,null,null,null,null,null,null,null,null,null,null,null,null,null,null,null,null,null,null,null,null,null,null,null,null,null,null,null,null,null,null,null,null,null,null,null,null,null,null,null,26.6,427.5]
[null,null,null,null,null,null,null,null,null,null,null,null,null,null,null,null,null,null,null,null,null,null,null,null,null,null,null,null,null,null,null,null,null,null,null,null,null,null,null,null,null,15.6,121.7]
[null,null,null,null,null,null,null,null,null,null,null,null,null,null,null,null,null,null,null,null,null,null,null,null,null,null,null,null,null,null,null,null,null,null,null,null,null,null,null,null,null,14,298]
[null,null,null,null,null,null,null,null,null,null,null,null,null,null,null,null,null,null,null,null,null,null,null,null,null,null,null,null,null,null,null,null,null,null,null,null,null,null,null,null,null,89,643]
[null,null,null,null,null,null,null,null,null,null,null,null,null,null,null,null,null,null,null,null,null,null,null,null,null,null,null,null,null,null,null,null,null,null,null,null,null,null,null,null,null,84,457]

{"sheet":"aliments","index":3,"n_rows":159,"n_cols":30,"rows_kept":159,"cut":false,"hidden":true,"merged":[]}
["No","Aliment","MS","NEL","NEV","PAIE","PAIN","PME","PMN","MA","MG","CB","ENA","SU","MO","CE","Ca","P","Mg","Na","K","dMO","dMA","dMG","dCB","dENA","deMA","dAA","amidon","deAM"]
[1,"Amidon de céréales ",1000,8.8000000000000007,10,69,13,99,13,19,1,4,968,0,992,8,0.3,1.4,0.2,2.1,1,94,60,60,30,95,70,90,967,75]
[49,"Arachide, tourteau de pression, décortiquée",1000,8.5,9.1,194,366,88,398,542,77,70,255,73,944,56,1.5,6.6,3.6,0.3,14,86,90,90,40,90,76,95,""]
[48,"Arachide, tourteau d'extraction, décortiquée",1000,7.6,8,205,388,92,422,575,22,74,270,107,941,59,1.5,7.2,3.7,0.4,13,86,90,80,40,90,76,95,""]
[7,"Avoine, balles ",1000,3,2.4,39,15,55,20,26,8,374,542,10,950,50,0.6,0.7,0.5,0.1,4,41,"-","-","-","-",60,70,""]
[6,"Avoine, farine de déchets (issues)",1000,4,3.6,53,55,59,70,90,40,219,606,12,955,45,1.6,4,1.1000000000000001,0.3,5,48,40,78,48,47,80,75,""]
[5,"Avoine, farine fourragère ",1000,7.7,8.1999999999999993,89,95,93,114,146,76,71,677,19,970,30,1,5.4,1.7,0.1,5,77,79,91,36,79,80,90,""]
[4,"Avoine, flocons ",1000,9.5,10.6,100,92,116,114,147,75,16,741,18,979,21,0.9,5,1.4,0.1,4,92,80,90,80,95,80,80,""]
[2,"Avoine, grain, léger (42-49 kg/hl)",1000,6.6,6.9,82,72,93,86,111,42,123,693,16,969,31,0.9,4.0999999999999996,1.2,0.1,5,72,78,81,31,78,80,90,""]
[3,"Avoine, grain, moyen à lourd (50-57 kg/hl)",1000,6.9,7.2,84,73,96,87,112,47,109,701,17,969,31,0.9,4.0999999999999996,1.2,0.1,5,74,78,81,31,80,80,90,""]
[116,"Babeurre frais ",1000,8.6999999999999993,9.6999999999999993,101,190,109,276,311,69,0,540,469,920,80,11,9.6999999999999993,1.1000000000000001,5.0999999999999996,17,92,90,90,0,94,90,90,""]
[117,"Babeurre, poudre ",1000,8.1999999999999993,9.1,100,190,107,276,311,52,0,524,421,887,113,11,9.5,1,19.7,17,92,90,90,0,94,90,90,""]
[81,"Betterave fourragère, fraîche",1000,7.4,8.1999999999999993,85,41,119,54,70,2,47,814,596,933,67,2.1,2.2000000000000002,1.3,0.7,18,89,55,40,75,93,80,60,""]
[82,"Betterave sucrière, fraîche ",1000,7.4,8.1999999999999993,84,33,120,44,57,2,47,827,676,933,67,2.1,1.5,1.3,0.7,9,90,55,30,75,93,80,60,""]
[84,"Betteraves, pulpe, ensilée",1000,7.1,7.7,101,70,108,53,106,10,215,612,18,943,57,7.5,1.2,2.6,1.8,7,85,60,30,80,92,55,75,""]
[83,"Betteraves, pulpe, séchée",1000,7.2,7.7,116,72,108,46,103,10,209,621,66,943,57,7.8,1,2.1,1.8,7,85,60,30,80,92,50,80,""]
[135,"Bicarbonate de soude ",1000,0,0,0,0,0,0,0,0,0,0,0,0,1000,0,0,0,270,0,"-","-","-","-","-","-","-"]
[9,"Blé germé, grain ",1000,7.6,8.1999999999999993,98,93,109,111,147,13,24,797,32,981,19,0.5,4.4000000000000004,1.2,0.1,3,83,72,76,35,87,78,80,""]
[10,"Blé, farine fourragère 1re (claire)",1000,8.9,10,114,116,121,139,184,28,9,760,74,981,19,0.5,4.5,1.4,0.1,4,93,85,82,47,96,78,80,""]
[11,"Blé, farine fourragère 2e (foncée)",1000,7.6,8.1999999999999993,102,124,100,149,197,52,50,660,64,959,41,1.2,8.8000000000000007,2.9,0.1,9,82,81,75,33,86,78,80,""]
[14,"Blé, germe ",1000,9.4,10.4,123,201,99,246,325,106,27,492,128,950,50,0.8,12.4,3.1,0.1,11,91,90,90,40,94,78,75,""]
[15,"Blé, gluten ",1000,9.1999999999999993,9.8000000000000007,255,545,102,617,854,11,4,121,4,990,10,1,2.2000000000000002,0.5,0.1,1,96,96,90,40,97,75,80,""]
[8,"Blé, grain ",1000,8.5,9.5,115,99,119,106,147,15,24,795,32,981,19,0.5,4.4000000000000004,1.2,0.1,4,91,78,83,51,95,75,94,""]
[12,"Blé, remoulage ",1000,7.1,7.6,99,116,98,139,184,39,72,664,65,959,41,1.2,8.5,2.8,0.1,7,79,81,75,33,83,78,80,""]
[13,"Blé, son ",1000,6.1,6.3,101,118,83,121,181,38,112,603,66,934,66,1.5,14,4.7,0.1,13,71,78,69,31,76,70,80,""]
[147,"Boulangerie, déchets ",1000,8.4,9.4,114,98,115,100,150,26,9,784,58,969,31,0.4,2.2999999999999998,1,9.3000000000000007,4,90,85,82,47,92,70,80]
[114,"Cacao, pelures ",1000,2.2000000000000002,1.6,29,72,20,98,177,51,183,502,36,913,87,3.4,4.2,5.2,0.9,30,29,15,50,32,30,60,20,""]
[115,"Café, marc ",1000,2.4,1.5,19,34,0,27,120,242,463,164,14,989,11,1.9,0.6,0.7,0.7,2,18,9,40,7,21,30,20,""]
[136,"Carbonate de calcium ",1000,0,0,0,0,0,0,0,0,0,0,0,0,1000,380,0,0.9,0,0,"-","-","-","-","-","-","-"]
[88,"Carotte rouge ",1000,6.9,7.5,80,82,101,116,139,17,73,662,110,891,109,2.7,2.7,2.1,3,33,85,65,64,79,90,85,65,""]
[87,"Carotte, racine ",1000,7.4,8.1,80,56,109,80,96,15,91,697,256,899,101,3,3,1.9,3.5,26,89,60,77,86,94,85,65,""]
[99,"Caroube ",1000,6,6.3,77,37,94,36,57,11,90,809,415,967,33,5.2,1,0.6,0.2,8,73,16,60,47,80,67,80,""]
[118,"Caséine, poudre ",1000,8.6999999999999993,9.1999999999999993,163,559,112,813,914,14,0,17,0,945,55,2.6,7.7,0.2,0.2,1,95,95,90,0,95,90,90,""]
[89,"Choux-rave ",1000,7.1,7.7,85,70,106,92,118,12,111,663,401,904,96,5.0999999999999996,4,1.6,1.7,30,87,70,60,82,92,80,65,""]
[50,"Colza, graine ",1000,13.1,14.8,49,122,39,170,219,441,80,209,52,949,51,4.5,8.1,3.1,0.4,9,79,75,94,24,73,80,50,""]
[52,"Colza, tourteau de presse, 4-9 % MG",1000,7.2,7.5,134,232,78,258,363,75,117,365,127,920,80,8.1,12.6,5.2,0.3,15,77,83,90,28,83,74,80,""]
[53,"Colza, tourteau de pression, > 9 % MG",1000,7.7,8.1999999999999993,128,224,74,249,350,108,112,352,119,922,78,8.6,12.8,5.2,0.3,17,77,83,90,28,83,74,80,""]
[54,"Colza, tourteau de pression, filière bio-diesel",1000,8.4,9,95,196,82,267,320,140,101,368,114,929,71,8.1999999999999993,12.3,5,0.3,16,78,93,90,28,83,85,80]
[51,"Colza, tourteau d'extraction",1000,6.2,6.4,140,247,80,274,385,18,124,388,99,915,85,9.9,14,5.0999999999999996,0.3,14,75,83,80,24,83,74,80,""]
[55,"Coprah, tourteau d'extraction",1000,6.7,7,184,183,82,89,236,24,172,493,125,925,75,1.8,6.5,3.9,0.9,18,79,80,80,60,85,44,90,""]
[56,"Coton, graine ",1000,8,8.1999999999999993,85,152,47,168,233,220,232,271,40,956,44,1.7,6.9,3.9,0.4,12,63,74,90,30,60,75,85,""]
[58,"Coton, tourteau d'extrac- tion, non décortiqué",1000,5.2,5,156,212,65,169,304,13,262,359,51,938,62,1.9,10.7,4.9000000000000004,0.6,14,64,74,65,45,70,60,85,""]
[57,"Coton, tourteau d'extrac- tion, partiel. décortiqué",1000,6.2,6.3,213,311,69,248,446,16,148,323,54,933,67,2.2999999999999998,12,5.4,0.5,15,74,84,65,37,78,60,85,""]
[126,"Cretons, farine ",1000,10.1,10.9,293,526,68,480,864,99,5,0,0,968,32,5,5.6,0.8,10,5,95,95,95,30,0,60,65]
[148,"Dextrose ",1000,9.1999999999999993,10.6,93,0,145,0,0,0,0,999,999,999,1,0,0,0,0,0,100,0,0,0,100,"-","-"]
[18,"Drêches de brasserie, ensilées",1000,6,6,112,164,62,151,247,80,179,446,38,952,48,3.5,6,2.2999999999999998,0.4,1,62,74,90,44,58,65,80,""]
[16,"Drêches de brasserie, fraîches",1000,6.1,6.2,124,158,64,130,234,76,171,472,13,953,47,3.8,6.7,2.5,0.4,1,64,74,90,44,62,60,80,""]
[17,"Drêches de brasserie, séchées",1000,6.3,6.3,148,176,57,112,252,88,176,438,10,954,46,3.2,5.3,1.6,0.6,1,64,74,90,44,60,50,80,""]
[90,"Endive, racine ",1000,7.1,7.7,77,52,105,73,88,18,108,688,131,902,98,5,2.6,1.3,0.7,20,86,71,60,77,90,85,65,""]
[20,"Epeautre, balles ",1000,2.5,1.8,41,22,39,11,34,16,456,430,47,936,64,0.8,2.2000000000000002,0.5,0,4,35,"-","-","-","-",60,70,""]
[19,"Epeautre, grain ",1000,6.4,6.6,91,92,93,106,145,18,133,673,30,969,31,0.7,4.3,1.1000000000000001,0.1,4,73,76,80,46,78,76,80,""]
[76,"Féverole, graine ",1000,7.3,7.7,129,194,107,233,300,9,85,567,41,961,39,1,6.9,1.8,0.2,13,83,75,70,60,91,80,90,""]
[127,"Graisse animale ",1000,21,23,0,0,0,0,0,1000,0,0,0,1000,0,0,0,0,0,0,"-","-","-","-","-","-","-"]
[151,"Graisse cristalline ",1000,20,22,0,0,0,0,0,920,0,70,0,990,10,0,0,0,0,0,"-","-","-","-","-","-","-"]
[59,"Graisse ou huile végétale ",1000,21,23,0,0,0,0,0,1000,0,0,0,1000,0,0,0,0,0,0,"-","-","-","-","-","-","-",""]
[149,"Graisse saponifiée ",1000,17,18.600000000000001,0,0,0,0,0,850,0,0,0,850,150,80,0,0,0,0,"-","-","-","-","-","-","-"]
[150,"Graisse, mélange d'acides gras",1000,21,23,0,0,0,0,0,995,0,0,0,995,5,0,0,0,0,0,"-","-","-","-","-","-","-"]
[77,"Haricot toasté, graine ",1000,7.7,8.3000000000000007,145,174,102,163,257,17,53,624,53,951,49,1.6,5.3,1.8,0.3,15,87,85,70,60,90,67,85,""]
[107,"Herbe 13 % MA, farine, déshydratée",1000,6.1,6.2,93,83,82,77,128,33,235,514,86,910,90,7,3.1,1.5,0.3,26,76,"-","-","-","-",61,65,""]
[108,"Herbe 17 % MA, farine, déshydratée",1000,6.3,6.5,105,110,89,108,176,40,182,501,89,899,101,7,3.5,1.5,0.3,31,79,"-","-","-","-",65,70,""]
[132,"Huile de foie de morue ",1000,21,23,0,0,0,0,0,999,0,0,0,999,1,0,0,0,0,0,"-","-","-","-","-","-","-"]
[119,"Lactose ",1000,9.1999999999999993,10.6,93,0,145,0,0,0,0,999,999,999,1,0,0,0,0,0,100,0,0,0,100,"-","-",""]
[120,"Lactosérum frais (petit-lait)",1000,8,8.9,104,86,122,103,132,7,0,780,709,919,81,5.8,6.1,1.1000000000000001,6.2,23,94,90,90,0,95,80,90,""]
[121,"Lactosérum, poudre (petit-lait)",1000,7.9,8.9,103,82,120,99,127,10,0,777,725,914,86,5.8,6.5,1.1000000000000001,7.4,24,94,90,90,0,95,80,90,""]
[122,"Lait écrémé frais ",1000,8.1,8.9,149,244,115,293,376,6,0,535,491,917,83,13.7,10.8,1.1000000000000001,4.7,17,95,95,90,0,95,80,90,""]
[123,"Lait écrémé, poudre ",1000,8.1,8.9,148,239,115,287,369,8,0,541,508,918,82,13.6,10.6,1.1000000000000001,4.5,16,95,94,90,0,95,80,90,""]
[124,"Lait entier frais ",1000,13.4,15.5,102,164,80,197,253,309,0,383,365,945,55,9.3000000000000007,7.5,0.8,2.8,11,97,95,98,0,97,80,90,""]
[125,"Lait entier, poudre ",1000,12.3,14.2,111,179,87,215,276,250,0,412,378,938,62,9.9,7.9,0.8,3.3,15,96,94,98,0,97,80,90]
[152,"Levure de brasserie, séchée",1000,7.4,7.8,138,286,94,362,465,30,2,428,23,925,75,2.6,15,2.2000000000000002,2.4,24,84,82,61,50,88,80,75]
[153,"Levure fourragère 48 % MA, séchée (Torula)",1000,7.5,7.8,146,332,87,421,541,58,13,319,3,931,69,7.3,15.6,1.2,0.3,13,82,82,61,50,88,80,75,""]
[60,"Lin, graine ",1000,12.2,13.6,84,157,46,178,246,378,72,256,37,952,48,2.7,5.8,4.5999999999999996,0.6,9,79,80,93,30,72,75,80,""]
[62,"Lin, tourteau de pression, 4-7 % MG",1000,7.1,7.4,171,250,74,219,365,65,97,402,44,929,71,4.4000000000000004,8.6,5.3,1.1000000000000001,12,76,83,90,22,80,64,85,""]
[63,"Lin, tourteau de pression, 8-12 % MG",1000,7.8,8.3000000000000007,162,238,70,208,347,110,92,384,45,933,67,4.2,8.9,5.7,0.5,11,77,83,90,22,80,64,85,""]
[61,"Lin, tourteau d'extraction ",1000,6.5,6.6,178,260,76,228,380,27,101,418,54,926,74,4.5,9.5,6,1.1000000000000001,12,75,83,80,22,80,64,85,""]
[78,"Lupin blanc doux, graine ",1000,9.1,9.9,143,257,99,308,396,95,121,347,66,959,41,2.5,5.0999999999999996,2.2999999999999998,0.2,12,89,88,88,88,92,80,90,""]
[109,"Luzerne 14 % MA, farine, déshydratée",1000,4.8,4.5999999999999996,87,93,70,88,150,25,330,400,36,905,95,15.2,2.9,2.2000000000000002,0.5,29,62,"-","-","-","-",63,70,""]
[110,"Luzerne 18 % MA, farine, déshydratée",1000,5.3,5.3,97,116,74,115,184,28,278,405,37,895,105,16,2.6,2.9,0.5,29,68,"-","-","-","-",66,70,""]
[137,"Magnésium, chlorure ",1000,0,0,0,0,0,0,0,0,0,0,0,0,1000,0,0,120,0,0,"-","-","-","-","-","-","-"]
[138,"Magnésium, oxyde ",1000,0,0,0,0,0,0,0,0,0,0,0,0,1000,30.3,0,510,0,0,"-","-","-","-","-","-","-"]
[25,"Maïs 60 % MA, gluten ",1000,8.4,8.9,509,570,43,154,689,46,9,222,8,966,34,0.2,5.2,0.3,0.2,1,88,88,76,20,94,30,90,154,75]
[26,"Maïs 70 % MA, gluten ",1000,8.4,8.9,556,632,34,170,764,54,9,138,5,965,35,0.2,4.0999999999999996,0.3,0.2,1,88,88,76,20,94,30,90,96,75]
[111,"Maïs plante entière, déshydraté",1000,6.4,6.6,85,51,93,45,81,23,197,654,117,955,45,2.2999999999999998,2.7,0.9,0.1,13,74,"-","-","-","-",60,70,""]
[24,"Maïs, aliment de gluten (gluten feed)",1000,7.4,7.9,127,156,89,150,232,26,78,606,23,942,58,1.5,9.5,4.0999999999999996,2.8,14,83,80,81,66,87,68,85,237,75]
[23,"Maïs, farine fourragère ",1000,8.1,8.8000000000000007,106,83,77,45,116,75,58,717,42,966,34,0.6,5.0999999999999996,2.6,0.5,6,82,62,85,60,87,45,80,490,75]
[22,"Maïs, germes ",1000,9.6,10.5,117,119,79,92,166,212,58,506,73,942,58,0.1,1.2,0.4,0,1,81,70,85,60,85,60,90,298,75]
[21,"Maïs, grain ",1000,8.5,9.5,112,79,82,35,97,43,23,822,19,985,15,0.2,3.2,1.2,0.1,4,88,60,79,20,94,42,95,710,70]
[27,"Maïs, rafles ",1000,4.0999999999999996,3.7,51,14,70,10,30,9,350,586,93,975,25,0.5,0.7,0.2,0.2,5,51,"-","-","-","-",60,70,""]
[29,"Maïs-épis, complet, séché ",1000,7.7,8.4,88,54,93,46,83,35,90,773,33,981,19,0.3,2.7,1,0.1,4,83,55,75,55,90,60,75,420,75]
[30,"Maïs-épis, ensilé, sans spathes, 30 % de rafles",1000,8,8.8000000000000007,88,61,85,40,91,41,46,807,8,985,15,0.2,3,1.2,0.2,7,84,60,79,40,90,50,75,646,75]
[31,"Maïs-épis, ensilé, sans spathes, 80 % de rafles",1000,7.9,8.6999999999999993,83,57,79,43,86,38,70,789,8,983,17,0.2,3,1.2,0.2,5,84,60,79,50,90,50,75,625,75]
[28,"Maïs-grain, ensilé ",1000,8.5,9.5,100,69,90,38,97,43,23,822,7,985,15,0.2,3.2,1.2,0.1,4,89,60,79,30,94,45,80,659,75]
[32,"Malt, germe ",1000,6.4,6.7,108,176,91,219,282,16,149,483,135,930,70,2.5,7.9,1.8,0.5,9,77,78,78,74,78,80,80,""]
[91,"Manioc, farine ",1000,7.5,8.3000000000000007,83,16,116,13,23,3,48,861,32,935,65,2.9,1.1000000000000001,1.1000000000000001,0.3,8,87,41,40,20,92,60,80,""]
[100,"Marc de poires, séché ",1000,4.0999999999999996,3.7,53,16,64,6,55,11,346,574,188,986,14,1,0.9,0.3,0.3,4,53,40,39,35,65,20,25,""]
[102,"Marc de pommes, dépectinisé, séché",1000,4.3,4,59,22,62,9,81,32,322,487,160,922,78,13.1,1.2,0.3,3.8,1,56,40,39,49,65,20,25,""]
[101,"Marc de pommes, séché ",1000,5.4,5.4,65,17,81,7,61,23,224,665,218,973,27,1.3,1.4,0.6,0.1,6,66,40,39,49,75,20,25,""]
[103,"Marc de raisins, séché ",1000,2.9,2.2000000000000002,41,43,24,29,132,73,277,441,180,923,77,6.1,3,1.1000000000000001,0.1,17,36,13,49,37,40,30,25,""]
[85,"Mélasse de betteraves ",1000,7.6,8.5,76,74,118,128,128,0,0,757,625,885,115,1.5,0.1,0.2,5.7,40,92,75,0,0,95,100,0,""]
[33,"Millet, grain, < 4 % CB (milocorn, sorgho)",1000,8,8.8000000000000007,102,73,81,40,102,29,23,828,11,982,18,0.4,3.5,1.4,0.1,4,85,53,81,24,91,45,80,753,75]
[35,"Millet, grain, > 6 % CB ",1000,7.1,7.6,102,79,75,43,111,34,105,712,9,962,38,0.4,3.5,1.4,0.1,4,78,71,81,20,88,45,80,569,75]
[34,"Millet, grain, 4-6 % CB ",1000,7.6,8.1999999999999993,106,81,79,44,113,37,63,760,9,973,27,0.4,3.5,1.4,0.1,4,82,53,81,24,91,45,80,608,75]
[64,"Moutarde blanche, graine, toastée",1000,10.7,11.7,105,210,59,249,344,278,95,232,45,949,51,5.0999999999999996,9,3.1,0.1,8,81,87,89,54,74,75,70,""]
[41,"Orge, farine de déchets ",1000,6.4,6.6,82,78,91,94,126,41,133,654,66,954,46,1.3,5.3,1.8,0.1,6,72,73,70,35,80,77,75,""]
[40,"Orge, farine fourragère ",1000,7.5,8.1,98,87,105,98,132,36,82,714,72,964,36,0.7,5.5,1.6,0.1,7,82,73,70,35,90,77,90,""]
[39,"Orge, flocons ",1000,9,10.1,120,71,128,83,112,13,10,852,15,987,13,0.5,3,0.6,0.1,3,96,90,41,21,98,60,80,""]
[36,"Orge, grain, léger (55-61 kg/hl)",1000,7.4,8,99,82,107,89,123,16,59,775,26,973,27,0.6,4.5,1.2,0.1,6,83,73,70,35,88,75,90,""]
[38,"Orge, grain, lourd (70-74 kg/hl)",1000,7.9,8.6999999999999993,103,80,113,87,120,16,42,797,27,975,25,0.6,4.5,1.2,0.1,6,87,73,70,35,92,75,90,""]
[37,"Orge, grain, moyen (62-69 kg/hl)",1000,7.7,8.4,100,77,110,84,116,16,51,791,27,974,26,0.6,4.5,1.2,0.1,6,85,73,70,35,90,75,90,""]
[139,"Os dégélatinisés,  farine fourragère",1000,0,0,0,0,0,0,83,25,0,44,0,152,848,294.5,137.69999999999999,6.6,4.5999999999999996,2,"-","-","-","-","-","-","-"]
[112,"Paille ",1000,3.3,2.8,45,21,53,19,34,15,438,458,16,945,55,3.7,1.2,1,2.9,14,44,"-","-","-","-",60,70,""]
[113,"Paille traitée, NaOH ",1000,3.9,3.5,54,21,65,19,33,12,428,452,16,925,75,3.6,1.1000000000000001,1,16.5,14,53,"-","-","-","-",60,70,""]
[65,"Palmiste, tourteau d'extraction",1000,6.8,7.1,156,142,86,70,197,21,196,542,26,956,44,3,7.2,3.9,0.1,7,77,75,90,55,86,42,80,""]
[155,"Panure ",1000,8.4,9.4,108,93,119,105,146,13,7,816,61,982,18,0.3,2.1,0.5,4.3,2,91,85,82,47,92,75,80,""]
[156,"Pâtes ",1000,8.4,9.3000000000000007,121,106,123,112,168,2,2,820,37,992,8,0.1,2.1,0.5,1.1000000000000001,2,91,85,82,47,92,70,75,""]
[140,"Phosphate bicalcique ",1000,0,0,0,0,0,0,0,0,0,0,0,0,1000,280,210,0,0,0,"-","-","-","-","-","-","-"]
[141,"Phosphate bicalcique dihyd. ",1000,0,0,0,0,0,0,0,0,0,0,0,0,1000,240,180,0,0,0,"-","-","-","-","-","-","-"]
[142,"Phosphate bisodique dihyd. ",1000,0,0,0,0,0,0,0,0,0,0,0,0,1000,0,174,0,258,0,"-","-","-","-","-","-","-"]
[143,"Phosphate monocalcique ",1000,0,0,0,0,0,0,0,0,0,0,0,0,1000,160,240,0,0,0,"-","-","-","-","-","-","-"]
[128,"Plumes hydrolysées, farine ",1000,8.4,8.6999999999999993,494,595,19,197,885,67,9,13,0,974,26,5.2,3.6,0.4,1,1,84,86,84,0,0,30,70]
[105,"Poire, fruit ",1000,7.7,8.5,80,11,121,15,19,11,151,797,529,978,22,0.7,0.6,0.5,0.1,5,89,60,30,65,95,80,60,""]
[79,"Pois protéagineux, graine ",1000,8,8.8000000000000007,130,164,116,189,250,10,59,648,69,967,33,1.3,5.0999999999999996,1.3,0.1,11,89,83,59,81,93,78,90,""]
[133,"Poisson 64 % MA, farine ",1000,7.8,8.3000000000000007,418,541,29,246,690,103,5,7,0,805,195,47.9,28.1,2.5,10.8,11,87,88,86,30,50,42,90]
[134,"Poisson 70/72 % MA, farine ",1000,8.1,8.6,463,599,32,272,764,90,3,0,0,857,143,26.6,22.9,2,10.1,11,88,88,86,30,50,42,90]
[93,"Pomme de terre de consom- mation, crue",1000,7.6,8.4,79,69,92,86,110,3,28,804,35,945,55,1,2.5,1,0.1,22,88,55,30,70,93,80,80,677,75]
[92,"Pomme de terre fourragère, crue",1000,7.6,8.4,75,57,91,71,91,3,23,812,37,929,71,1,2.5,1,0.1,22,89,55,30,70,93,80,80,697,75]
[106,"Pomme, fruit ",1000,7.9,8.6999999999999993,81,13,121,18,23,19,104,832,554,978,22,0.6,0.7,0.5,0.4,9,90,60,30,65,95,80,60,""]
[97,"Pommes de terre, amidon ",1000,8.9,10.199999999999999,66,3,101,2,4,1,1,989,0,995,5,0.2,0.5,0.1,0.3,1,95,40,30,40,95,60,80,988,75]
[95,"Pommes de terre, farine ",1000,7.8,8.6,92,57,102,52,82,1,25,845,41,953,47,0.6,2.4,0.8,0.1,18,89,48,30,73,93,67,90,757,85]
[94,"Pommes de terre, flocons ",1000,7.9,8.8000000000000007,98,67,104,62,101,2,27,824,40,954,46,0.6,2.5,1.1000000000000001,0.2,20,90,48,40,73,96,65,80,738,85]
[96,"Pommes de terre, protéine ",1000,8,8.3000000000000007,506,662,56,333,856,6,6,99,6,967,33,1.2,3.3,1,0.1,18,89,89,30,50,93,45,90,""]
[157,"Propanediol, 1,2- (Propylèneglycol)",1000,14,14,93,0,145,0,0,0,0,1000,0,1000,0,0,0,0,0,0,"-","-","-","-","-","-","-",""]
[144,"Propionate de calcium ",1000,10,10,0,0,0,0,0,0,0,493,0,493,507,214,0,0,0,0,"-","-","-","-","-","-","-"]
[145,"Propionate de sodium ",1000,11,11,0,0,0,0,0,0,0,560,0,560,440,0,0,0,240,0,"-","-","-","-","-","-","-"]
[154,"Protéine fourragère 70 % MA (protéine bactérienne)",1000,8.5,8.9,128,449,106,677,761,50,10,118,5,939,61,2.7,14,2.1,5.8,3,91,94,61,50,88,90,70,""]
[104,"Pulpe d'agrumes, séchée ",1000,7.4,8.1,91,48,107,44,72,34,140,691,241,937,63,18.899999999999999,1.3,1.5,0.8,9,85,50,80,80,90,65,80,""]
[98,"Rave ",1000,6.4,6.9,81,79,96,103,133,15,117,615,353,880,120,5.9,5.8,0.7,3,46,82,83,74,93,80,80,65,""]
[42,"Riz, brisures ",1000,8.6,9.6,95,58,96,42,84,9,4,896,48,993,7,0.1,1.4,0.4,0.1,1,92,71,67,30,94,55,80,845,75]
[44,"Riz, farine fourragère blanche",1000,8.1,8.8000000000000007,99,99,65,72,144,145,66,558,62,913,87,1,14,6.3,0.6,11,77,73,85,45,80,55,80,331,85]
[43,"Riz, farine fourragère jaune",1000,8.5,9.1999999999999993,103,114,57,83,166,189,80,467,61,902,98,0.9,12.8,4.2,0.6,11,77,73,85,45,80,55,80,244,85]
[129,"Sang, farine ",1000,7.8,7.9,638,722,11,159,947,13,0,8,0,968,32,1.7,1.7,0.3,4.2,3,85,85,90,0,50,25,80]
[45,"Seigle, grain ",1000,8.1999999999999993,9.1,98,72,118,86,114,14,22,831,64,981,19,0.5,4.0999999999999996,1.2,0.1,5,89,70,67,30,94,78,80,""]
[146,"Sodium, chlorure (sel bét.) ",1000,0,0,0,0,0,0,0,0,0,0,0,0,1000,0,0,0,390,0,"-","-","-","-","-","-","-"]
[68,"Soja, coques ",1000,6.7,6.9,102,82,96,72,130,24,373,420,26,947,53,5.5,1.8,2,0.1,13,79,60,75,80,85,60,70,""]
[66,"Soja, graine ",1000,9.8000000000000007,10.6,120,255,74,317,407,196,60,284,82,947,53,2.8,6.3,3,0.2,18,83,85,90,60,80,80,80,""]
[67,"Soja, graine, extrudée",1000,9.6999999999999993,10.5,153,269,67,275,413,190,54,281,77,938,62,2.7,6.4,3.1,0.1,19,83,85,90,60,80,70,80,""]
[71,"Soja, tourteau de pression, non décortiqué",1000,8.6999999999999993,9.4,249,349,84,268,473,71,62,322,99,928,72,3.1,6.8,3.2,0.2,22,90,91,90,70,93,61,95,""]
[69,"Soja, tourteau d'extraction, 44 % MA, non décortiqué",1000,7.8,8.3000000000000007,261,368,87,283,499,20,65,340,105,924,76,3.6,7.7,3.6,0.4,22,90,91,52,80,93,61,95,""]
[70,"Soja, tourteau d'extraction, 48 % MA, partiel. décortiqué",1000,7.9,8.4,277,398,86,306,539,17,53,322,102,931,69,3.5,7.4,3.1,0.2,24,90,91,52,80,93,61,95,""]
[46,"Sous-produits de meunerie, mélange",1000,6.4,6.7,93,110,88,128,177,43,90,636,62,946,54,1.5,10.9,3.9,0.1,11,72,75,75,40,76,75,75,""]
[86,"Sucre fourrager ",1000,9.4,10.9,91,0,142,0,0,0,0,978,978,978,22,0.4,0.2,0,0.1,1,100,0,0,0,100,"-","-",""]
[72,"Tournesol, graine ",1000,9.9,10.6,58,123,37,153,197,325,261,181,52,964,36,2.4,5.5,2.8,0.1,8,64,80,96,18,55,80,80,""]
[74,"Tournesol, tourteau de presse, partiel. décortiqué",1000,6.3,6.3,118,219,64,248,333,86,240,274,83,933,67,3.2,9.4,6.6,0.3,16,65,85,93,32,60,77,90,""]
[75,"Tournesol, tourteau d'extrac- tion, non décortiqué",1000,4.0999999999999996,3.6,95,168,58,190,255,15,370,310,50,950,50,4.8,8.5,5,0.3,13,52,84,68,30,50,77,90]
[73,"Tournesol, tourteau d'extrac- tion, partiel. décortiqué",1000,5.0999999999999996,4.8,125,235,67,266,357,22,257,292,77,928,72,3.9,9.4,5.2,0.3,15,62,85,70,32,60,77,90,""]
[47,"Triticale, grain ",1000,8.3000000000000007,9.1999999999999993,103,81,118,93,125,14,23,817,42,979,21,0.6,4.3,1.1000000000000001,0.1,5,90,75,72,33,94,77,85,""]
[158,"Urée ",1000,0,0,0,1647,0,2860,2860,0,0,0,0,991,9,0,0.1,0.1,0.2,1,"-","-","-","-","-",100,"-",""]
[80,"Vesce, graine ",1000,8.1,8.8000000000000007,143,189,106,199,298,14,69,581,46,962,38,1.6,5,1.8,0.2,10,89,87,86,59,94,70,75,""]
[130,"Viande 60 % MA, farine ",1000,7.4,7.7,216,391,47,358,643,89,29,32,0,793,207,61.7,32.200000000000003,1.6,7.7,6,85,89,86,30,50,60,65]
[131,"Viande et os 40 % MA, fa- rine",1000,5.0999999999999996,5.3,148,278,26,254,457,84,9,12,0,562,438,149.80000000000001,73.099999999999994,2.2999999999999998,6.4,8,79,80,86,30,40,60,65]

{"sheet":"Futtermittel","index":4,"n_rows":159,"n_cols":30,"rows_kept":159,"cut":false,"hidden":true,"merged":[]}
["Fut","Futtermittel","TS","NEL","NEV","APD","APDN","PME","PMN","RP","RL","RF","NfE","Zu","OS","RA","Ca","P","Mg","Na","K","vOS","vRP","vRL","vRF","vNfE","aRP","vASF","ST","aST"]
[157,"1,2-Propandiol (Propylenglykol)",1000,14,14,93,0,145,0,0,0,0,1000,0,1000,0,0,0,0,0,0,"-","-","-","-","-","-","-"]
[99,"Äpfel, frisch ",1000,7.9,8.6999999999999993,81,13,121,18,23,19,104,832,554,978,22,0.6,0.7,0.5,0.4,9,90,60,30,65,95,80,60]
[147,"Backabfälle (Brotabfälle) ",1000,8.4,9.4,114,98,115,100,150,26,9,784,58,969,31,0.4,2.2999999999999998,1,9.3000000000000007,4,90,85,82,47,92,70,80]
[48,"Baumwolle, Samen, ganz ",1000,8,8.1999999999999993,85,152,47,168,233,220,232,271,40,956,44,1.7,6.9,3.9,0.4,12,63,74,90,30,60,75,85]
[50,"Baumwoll-Extraktions-  schrot nicht entschält",1000,5.2,5,156,212,65,169,304,13,262,359,51,938,62,1.9,10.7,4.9000000000000004,0.6,14,64,74,65,45,70,60,85]
[49,"Baumwoll-Extraktions- schrot teilentschält",1000,6.2,6.3,213,311,69,248,446,16,148,323,54,933,67,2.2999999999999998,12,5.4,0.5,15,74,84,65,37,78,60,85]
[9,"Biertreber (Gerste) frisch",1000,6.1,6.2,124,158,64,130,234,76,171,472,13,953,47,3.8,6.7,2.5,0.4,1,64,74,90,44,62,60,80]
[10,"Biertreber (Gerste) getrocknet",1000,6.3,6.3,148,176,57,112,252,88,176,438,10,954,46,3.2,5.3,1.6,0.6,1,64,74,90,44,60,50,80]
[11,"Biertreber (Gerste) siliert",1000,6,6,112,164,62,151,247,80,179,446,38,952,48,3.5,6,2.2999999999999998,0.4,1,62,74,90,44,58,65,80]
[100,"Birnen, frisch ",1000,7.7,8.5,80,11,121,15,19,11,151,797,529,978,22,0.7,0.6,0.5,0.1,5,89,60,30,65,95,80,60]
[126,"Blutmehl ",1000,7.8,7.9,638,722,11,159,947,13,0,8,0,968,32,1.7,1.7,0.3,4.2,3,85,85,90,0,50,25,80]
[76,"Bohne, Acker-, Samen ",1000,7.3,7.7,129,194,107,233,300,9,85,567,41,961,39,1,6.9,1.8,0.2,13,83,75,70,60,91,80,90]
[77,"Bohne, Samen, getoastet ",1000,7.7,8.3000000000000007,145,174,102,163,257,17,53,624,53,951,49,1.6,5.3,1.8,0.3,15,87,85,70,60,90,67,85]
[116,"Buttermilch, frisch ",1000,8.6999999999999993,9.6999999999999993,101,190,109,276,311,69,0,540,469,920,80,11,9.6999999999999993,1.1000000000000001,5.0999999999999996,17,92,90,90,0,94,90,90]
[117,"Buttermilchpulver ",1000,8.1999999999999993,9.1,100,190,107,276,311,52,0,524,421,887,113,11,9.5,1,19.7,17,92,90,90,0,94,90,90]
[148,"Dextrose (Traubenzucker) ",1000,9.1999999999999993,10.6,93,0,145,0,0,0,0,999,999,999,1,0,0,0,0,0,100,0,0,0,100,"-","-"]
[1,"Dinkel, Körner mit Spelzen ",1000,6.4,6.6,91,92,93,106,145,18,133,673,30,969,31,0.7,4.3,1.1000000000000001,0.1,4,73,76,80,46,78,76,80]
[2,"Dinkelspelzen  (Dinkelspreue)",1000,2.5,1.8,41,22,39,11,34,16,456,430,47,936,64,0.8,2.2000000000000002,0.5,0,4,35,"-","-","-","-",60,70]
[134,"Dorschlebertran  (Lebertran)",1000,21,23,0,0,0,0,0,999,0,0,0,999,1,0,0,0,0,0,"-","-","-","-","-","-","-"]
[78,"Erbse, Protein-, Samen ",1000,8,8.8000000000000007,130,164,116,189,250,10,59,648,69,967,33,1.3,5.0999999999999996,1.3,0.1,11,89,83,59,81,93,78,90]
[51,"Erdnuss-Extraktions- schrot a. entschälter Saat",1000,7.6,8,205,388,92,422,575,22,74,270,107,941,59,1.5,7.2,3.7,0.4,13,86,90,80,40,90,76,95]
[52,"Erdnusskuchen aus entschälter Saat",1000,8.5,9.1,194,366,88,398,542,77,70,255,73,944,56,1.5,6.6,3.6,0.3,14,86,90,90,40,90,76,95]
[127,"Federmehl  aufgeschlossen",1000,8.4,8.6999999999999993,494,595,19,197,885,67,9,13,0,974,26,5.2,3.6,0.4,1,1,84,86,84,0,0,30,70]
[53,"Fett oder Öl, pflanzlicher Herkunft",1000,21,23,0,0,0,0,0,1000,0,0,0,1000,0,0,0,0,0,0,"-","-","-","-","-","-","-"]
[153,"Fett, freie Fettsäuren ",1000,21,23,0,0,0,0,0,995,0,0,0,995,5,0,0,0,0,0,"-","-","-","-","-","-","-"]
[152,"Fett, Kalzium-Seife ",1000,17,18.600000000000001,0,0,0,0,0,850,0,0,0,850,150,80,0,0,0,0,"-","-","-","-","-","-","-"]
[154,"Fett, kristallines ",1000,20,22,0,0,0,0,0,920,0,70,0,990,10,0,0,0,0,0,"-","-","-","-","-","-","-"]
[128,"Fett, tierisches ",1000,21,23,0,0,0,0,0,1000,0,0,0,1000,0,0,0,0,0,0,"-","-","-","-","-","-","-"]
[132,"Fischmehl 64% RP ",1000,7.8,8.3000000000000007,418,541,29,246,690,103,5,7,0,805,195,47.9,28.1,2.5,10.8,11,87,88,86,30,50,42,90]
[133,"Fischmehl 70/72% RP ",1000,8.1,8.6,463,599,32,272,764,90,3,0,0,857,143,26.6,22.9,2,10.1,11,88,88,86,30,50,42,90]
[130,"Fleischknochenmehl  40% RP",1000,5.0999999999999996,5.3,148,278,26,254,457,84,9,12,0,562,438,149.80000000000001,73.099999999999994,2.2999999999999998,6.4,8,79,80,86,30,40,60,65]
[129,"Fleischmehl 60% RP ",1000,7.4,7.7,216,391,47,358,643,89,29,32,0,793,207,61.7,32.200000000000003,1.6,7.7,6,85,89,86,30,50,60,65]
[3,"Gerste, Körner leicht (55-61 kg/hl)",1000,7.4,8,99,82,107,89,123,16,59,775,26,973,27,0.6,4.5,1.2,0.1,6,83,73,70,35,88,75,90]
[4,"Gerste, Körner mittel (62-69 kg/hl)",1000,7.7,8.4,100,77,110,84,116,16,51,791,27,974,26,0.6,4.5,1.2,0.1,6,85,73,70,35,90,75,90]
[5,"Gerste, vollkörnig (70-74 kg/hl)",1000,7.9,8.6999999999999993,103,80,113,87,120,16,42,797,27,975,25,0.6,4.5,1.2,0.1,6,87,73,70,35,92,75,90]
[8,"Gerstebabfallmehl ",1000,6.4,6.6,82,78,91,94,126,41,133,654,66,954,46,1.3,5.3,1.8,0.1,6,72,73,70,35,80,77,75]
[6,"Gerstenflocken ",1000,9,10.1,120,71,128,83,112,13,10,852,15,987,13,0.5,3,0.6,0.1,3,96,90,41,21,98,60,80]
[7,"Gerstenfuttermehl ",1000,7.5,8.1,98,87,105,98,132,36,82,714,72,964,36,0.7,5.5,1.6,0.1,7,82,73,70,35,90,77,90]
[107,"Grasmehl 13% RP, künstlich getrocknet",1000,6.1,6.2,93,83,82,77,128,33,235,514,86,910,90,7,3.1,1.5,0.3,26,76,"-","-","-","-",61,65]
[108,"Grasmehl 17% RP, künstlich getrocknet",1000,6.3,6.5,105,110,89,108,176,40,182,501,89,899,101,7,3.5,1.5,0.3,31,79,"-","-","-","-",65,70]
[131,"Griebenmehl ",1000,10.1,10.9,293,526,68,480,864,99,5,0,0,968,32,5,5.6,0.8,10,5,95,95,95,30,0,60,65]
[12,"Hafer, Körner leicht (42-49 kg/hl)",1000,6.6,6.9,82,72,93,86,111,42,123,693,16,969,31,0.9,4.0999999999999996,1.2,0.1,5,72,78,81,31,78,80,90]
[13,"Hafer, mittel bis vollkörnig (50-57 kg/hl)",1000,6.9,7.2,84,73,96,87,112,47,109,701,17,969,31,0.9,4.0999999999999996,1.2,0.1,5,74,78,81,31,80,80,90]
[16,"Haferabfallmehl (Haferschälkleie)",1000,4,3.6,53,55,59,70,90,40,219,606,12,955,45,1.6,4,1.1000000000000001,0.3,5,48,40,78,48,47,80,75]
[14,"Haferflocken ",1000,9.5,10.6,100,92,116,114,147,75,16,741,18,979,21,0.9,5,1.4,0.1,4,92,80,90,80,95,80,80]
[15,"Haferfuttermehl ",1000,7.7,8.1999999999999993,89,95,93,114,146,76,71,677,19,970,30,1,5.4,1.7,0.1,5,77,79,91,36,79,80,90]
[17,"Haferspelzen ",1000,3,2.4,39,15,55,20,26,8,374,542,10,950,50,0.6,0.7,0.5,0.1,4,41,"-","-","-","-",60,70]
[155,"Harnstoff, Futter- ",1000,0,0,0,1647,0,2860,2860,0,0,0,0,991,9,0,0.1,0.1,0.2,1,"-","-","-","-","-",100,"-"]
[149,"Hefe, Bier-, getrocknet ",1000,7.4,7.8,138,286,94,362,465,30,2,428,23,925,75,2.6,15,2.2000000000000002,2.4,24,84,82,61,50,88,80,75]
[150,"Hefe, Futter-, 48% RP ",1000,7.5,7.8,146,332,87,421,541,58,13,319,3,931,69,7.3,15.6,1.2,0.3,13,82,82,61,50,88,80,75]
[19,"Hirse, Körner 4-6% RF ",1000,7.6,8.1999999999999993,106,81,79,44,113,37,63,760,9,973,27,0.4,3.5,1.4,0.1,4,82,53,81,24,91,45,80,608,75]
[20,"Hirse, Körner mehr als 6% ",1000,7.1,7.6,102,79,75,43,111,34,105,712,9,962,38,0.4,3.5,1.4,0.1,4,78,71,81,20,88,45,80,569,75]
[18,"Hirse, Körner unter 4% RF (Milocorn/Sorghum)",1000,8,8.8000000000000007,102,73,81,40,102,29,23,828,11,982,18,0.4,3.5,1.4,0.1,4,85,53,81,24,91,45,80,753,75]
[101,"Johannisbrot ",1000,6,6.3,77,37,94,36,57,11,90,809,415,967,33,5.2,1,0.6,0.2,8,73,16,60,47,80,67,80]
[114,"Kaffee-Extraktionsabfälle ",1000,2.4,1.5,19,34,0,27,120,242,463,164,14,989,11,1.9,0.6,0.7,0.7,2,18,9,40,7,21,30,20]
[115,"Kakaoschalen ",1000,2.2000000000000002,1.6,29,72,20,98,177,51,183,502,36,913,87,3.4,4.2,5.2,0.9,30,29,15,50,32,30,60,20]
[135,"Kalk, kohlensaurer ",1000,0,0,0,0,0,0,0,0,0,0,0,0,1000,380,0,0.9,0,0,"-","-","-","-","-","-","-"]
[81,"Karotte, Wurzel frisch ",1000,7.4,8.1,80,56,109,80,96,15,91,697,256,899,101,3,3,1.9,3.5,26,89,60,77,86,94,85,65]
[82,"Kartoffel, Futter-, Knolle frisch",1000,7.6,8.4,75,57,91,71,91,3,23,812,37,929,71,1,2.5,1,0.1,22,89,55,30,70,93,80,80,697,75]
[83,"Kartoffel, Speise-, Knolle frisch",1000,7.6,8.4,79,69,92,86,110,3,28,804,35,945,55,1,2.5,1,0.1,22,88,55,30,70,93,80,80,677,75]
[84,"Kartoffelflocken ",1000,7.9,8.8000000000000007,98,67,104,62,101,2,27,824,40,954,46,0.6,2.5,1.1000000000000001,0.2,20,90,48,40,73,96,65,80,738,85]
[85,"Kartoffelmehl ",1000,7.8,8.6,92,57,102,52,82,1,25,845,41,953,47,0.6,2.4,0.8,0.1,18,89,48,30,73,93,67,90,757,85]
[86,"Kartoffelprotein ",1000,8,8.3000000000000007,506,662,56,333,856,6,6,99,6,967,33,1.2,3.3,1,0.1,18,89,89,30,50,93,45,90]
[87,"Kartoffelstärke ",1000,8.9,10.199999999999999,66,3,101,2,4,1,1,989,0,995,5,0.2,0.5,0.1,0.3,1,95,40,30,40,95,60,80,988,75]
[118,"Kaseinpulver ",1000,8.6999999999999993,9.1999999999999993,163,559,112,813,914,14,0,17,0,945,55,2.6,7.7,0.2,0.2,1,95,95,90,0,95,90,90]
[136,"Knochenmehl entleimt ",1000,0,0,0,0,0,0,83,25,0,44,0,152,848,294.5,137.69999999999999,6.6,4.5999999999999996,2,"-","-","-","-","-","-","-"]
[88,"Kohlrübe, Wurzel frisch ",1000,7.1,7.7,85,70,106,92,118,12,111,663,401,904,96,5.0999999999999996,4,1.6,1.7,30,87,70,60,82,92,80,65]
[54,"Kokos-Extraktionsschrot ",1000,6.7,7,184,183,82,89,236,24,172,493,125,925,75,1.8,6.5,3.9,0.9,18,79,80,80,60,85,44,90]
[119,"Laktose ",1000,9.1999999999999993,10.6,93,0,145,0,0,0,0,999,999,999,1,0,0,0,0,0,100,0,0,0,100,"-","-"]
[55,"Lein, Samen ",1000,12.2,13.6,84,157,46,178,246,378,72,256,37,952,48,2.7,5.8,4.5999999999999996,0.6,9,79,80,93,30,72,75,80]
[56,"Lein-Extraktionsschrot ",1000,6.5,6.6,178,260,76,228,380,27,101,418,54,926,74,4.5,9.5,6,1.1000000000000001,12,75,83,80,22,80,64,85]
[57,"Leinkuchen 4-7% RL ",1000,7.1,7.4,171,250,74,219,365,65,97,402,44,929,71,4.4000000000000004,8.6,5.3,1.1000000000000001,12,76,83,90,22,80,64,85]
[58,"Leinkuchen 8-12% RL ",1000,7.8,8.3000000000000007,162,238,70,208,347,110,92,384,45,933,67,4.2,8.9,5.7,0.5,11,77,83,90,22,80,64,85]
[79,"Lupine, Süss-, Weisse, Samen",1000,9.1,9.9,143,257,99,308,396,95,121,347,66,959,41,2.5,5.0999999999999996,2.2999999999999998,0.2,12,89,88,88,88,92,80,90]
[109,"Luzernemehl 14% RP, künstlich getrocknet",1000,4.8,4.5999999999999996,87,93,70,88,150,25,330,400,36,905,95,15.2,2.9,2.2000000000000002,0.5,29,62,"-","-","-","-",63,70]
[110,"Luzernemehl 18% RP, künstlich getrocknet",1000,5.3,5.3,97,116,74,115,184,28,278,405,37,895,105,16,2.6,2.2000000000000002,0.5,29,68,"-","-","-","-",66,70]
[120,"Magermilch, frisch ",1000,8.1,8.9,149,244,115,293,376,6,0,535,491,917,83,13.7,10.8,1.1000000000000001,4.7,17,95,95,90,0,95,80,90]
[121,"Magermilchpulver ",1000,8.1,8.9,148,239,115,287,369,8,0,541,508,918,82,13.6,10.6,1.1000000000000001,4.5,16,95,94,90,0,95,80,90]
[137,"Magnesiumchlorid ",1000,0,0,0,0,0,0,0,0,0,0,0,0,1000,0,0,120,0,0,"-","-","-","-","-","-","-"]
[138,"Magnesiumoxyd ",1000,0,0,0,0,0,0,0,0,0,0,0,0,1000,30.3,0,510,0,0,"-","-","-","-","-","-","-"]
[21,"Mais, Körner ",1000,8.5,9.5,112,79,82,35,97,43,23,822,19,985,15,0.2,3.2,1.2,0.1,4,88,60,79,20,94,42,95,710,70]
[22,"Maisfuttermehl ",1000,8.1,8.8000000000000007,106,83,77,45,116,75,58,717,42,966,34,0.6,5.0999999999999996,2.6,0.5,6,82,62,85,60,87,45,80,490,75]
[23,"Maiskeime ",1000,9.6,10.5,117,119,79,92,166,212,58,506,73,942,58,0.1,1.2,0.4,0,1,81,70,85,60,85,60,90,298,75]
[25,"Maiskleber 60% RP ",1000,8.4,8.9,509,570,43,154,689,46,9,222,8,966,34,0.2,5.2,0.3,0.2,1,88,88,76,20,94,30,90,154,75]
[26,"Maiskleber 70% RP ",1000,8.4,8.9,556,632,34,170,764,54,9,138,5,965,35,0.2,4.0999999999999996,0.3,0.2,1,88,88,76,20,94,30,90,96,75]
[24,"Maiskleberfutter ",1000,7.4,7.9,127,156,89,150,232,26,78,606,23,942,58,1.5,9.5,4.0999999999999996,2.8,14,83,80,81,66,87,68,85,237,75]
[29,"Maiskolben, ganz, getr. ",1000,7.7,8.4,88,54,93,46,83,35,90,773,33,981,19,0.3,2.7,1,0.1,4,83,55,75,55,90,60,75,420,75]
[30,"Maiskolbensilage (ohne Lieschen) 30% Spindeln",1000,8,8.8000000000000007,88,61,85,40,91,41,46,807,8,985,15,0.2,3,1.2,0.2,7,84,60,79,40,90,50,75,646,75]
[31,"Maiskolbensilage (ohne Lieschen) 80% Spindeln",1000,7.9,8.6999999999999993,83,57,79,43,86,38,70,789,8,983,17,0.2,3,1.2,0.2,5,84,60,79,50,90,50,75,625,75]
[28,"Maiskörnersilage ",1000,8.5,9.5,100,69,90,38,97,43,23,822,7,985,15,0.2,3.2,1.2,0.1,4,89,60,79,30,94,45,80,659,75]
[111,"Maispflanzen, ganz, künstlich getrocknet",1000,6.4,6.6,85,51,93,45,81,23,197,654,117,955,45,2.2999999999999998,2.7,0.9,0.1,13,74,"-","-","-","-",60,70]
[27,"Maisspindelmehl ",1000,4.0999999999999996,3.7,51,14,70,10,30,9,350,586,93,975,25,0.5,0.7,0.2,0.2,5,51,"-","-","-","-",60,70]
[32,"Malzkeime ",1000,6.4,6.7,108,176,91,219,282,16,149,483,135,930,70,2.5,7.9,1.8,0.5,9,77,78,78,74,78,80,80]
[92,"Maniokmehl oder -schnitzel (Tapiokamehl)",1000,7.5,8.3000000000000007,83,16,116,13,23,3,48,861,32,935,65,2.9,1.1000000000000001,1.1000000000000001,0.3,8,87,41,40,20,92,60,80]
[122,"Molke frisch (Schotte) ",1000,8,8.9,104,86,122,103,132,7,0,780,709,919,81,5.8,6.1,1.1000000000000001,6.2,23,94,90,90,0,95,80,90]
[123,"Molkenpulver (Schottepulver)",1000,7.9,8.9,103,82,120,99,127,10,0,777,725,914,86,5.8,6.5,1.1000000000000001,7.4,24,94,90,90,0,95,80,90]
[33,"Mühlennachprodukte- gemisch (MNG)",1000,6.4,6.7,93,110,88,128,177,43,90,636,62,946,54,1.5,10.9,3.9,0.1,11,72,75,75,40,76,75,75]
[139,"Natriumbicarbonat ",1000,0,0,0,0,0,0,0,0,0,0,0,0,1000,0,0,0,270,0,"-","-","-","-","-","-","-"]
[140,"Natriumchlorid (Viehsalz) ",1000,0,0,0,0,0,0,0,0,0,0,0,0,1000,0,0,0,390,0,"-","-","-","-","-","-","-"]
[59,"Palmkern-Extraktions-  schrot",1000,6.8,7.1,156,142,86,70,197,21,196,542,26,956,44,3,7.2,3.9,0.1,7,77,75,90,55,86,42,80]
[156,"Paniermehl ",1000,8.4,9.4,108,93,119,105,146,13,7,816,61,982,18,0.3,2.1,0.5,4.3,2,91,85,82,47,92,75,80]
[141,"Phosphat, Dikalzium- ",1000,0,0,0,0,0,0,0,0,0,0,0,0,1000,280,210,0,0,0,"-","-","-","-","-","-","-"]
[144,"Phosphat, Monokalzium- ",1000,0,0,0,0,0,0,0,0,0,0,0,0,1000,160,240,0,0,0,"-","-","-","-","-","-","-"]
[142,"Phosphat-dihydrat, Dikalzium",1000,0,0,0,0,0,0,0,0,0,0,0,0,1000,240,180,0,0,0,"-","-","-","-","-","-","-"]
[143,"Phosphat-dihydrat, Dinatrium",1000,0,0,0,0,0,0,0,0,0,0,0,0,1000,0,174,0,258,0,"-","-","-","-","-","-","-"]
[145,"Propionat, Kalzium- ",1000,10,10,0,0,0,0,0,0,0,493,0,493,507,214,0,0,0,0,"-","-","-","-","-","-","-"]
[146,"Propionat, Natrium- ",1000,11,11,0,0,0,0,0,0,0,560,0,560,440,0,0,0,240,0,"-","-","-","-","-","-","-"]
[151,"Proteinfutter 70% RP (Bakterienprotein)",1000,8.5,8.9,128,449,106,677,761,50,10,118,5,939,61,2.7,14,2.1,5.8,3,91,94,61,50,88,90,70]
[89,"Rande, Knolle frisch ",1000,6.9,7.5,80,82,101,116,139,17,73,662,110,891,109,2.7,2.7,2.1,3,33,85,65,64,79,90,85,65]
[60,"Raps, Samen ",1000,13.1,14.8,49,122,39,170,219,441,80,209,52,949,51,4.5,8.1,3.1,0.4,9,79,75,94,24,73,80,50]
[61,"Raps-Extraktionsschrot ",1000,6.2,6.4,140,247,80,274,385,18,124,388,99,915,85,9.9,14,5.0999999999999996,0.3,14,75,83,80,24,83,74,80]
[63,"Rapskuchen >9% RL ",1000,7.7,8.1999999999999993,128,224,74,249,350,108,112,352,119,922,78,8.6,12.8,5.2,0.3,17,77,83,90,28,83,74,80]
[62,"Rapskuchen 4-9% RL ",1000,7.2,7.5,134,232,78,258,363,75,117,365,127,920,80,8.1,12.6,5.2,0.3,15,77,83,90,28,83,74,80]
[64,"Rapskuchen aus Bio-Diesel",1000,8.4,9,95,196,82,267,320,140,101,368,114,929,71,8.1999999999999993,12.3,5,0.3,16,78,83,90,28,83,85,80]
[34,"Reis, Körner (Bruchreis) ",1000,8.6,9.6,95,58,96,42,84,9,4,896,48,993,7,0.1,1.4,0.4,0.1,1,92,71,67,30,94,55,80,845,75]
[35,"Reisfuttermehl, gelb ",1000,8.5,9.1999999999999993,103,114,57,83,166,189,80,467,61,902,98,0.9,12.8,4.2,0.6,11,77,73,85,45,80,55,80,244,85]
[36,"Reisfuttermehl, weiss ",1000,8.1,8.8000000000000007,99,99,65,72,144,145,66,558,62,913,87,1,14,6.3,0.6,11,77,73,85,45,80,55,80,331,85]
[37,"Roggen, Körner ",1000,8.1999999999999993,9.1,98,72,118,86,114,14,22,831,64,981,19,0.5,4.0999999999999996,1.2,0.1,5,89,70,67,30,94,78,80]
[90,"Rübe, Futter-, frisch ",1000,7.4,8.1999999999999993,85,41,119,54,70,2,47,814,596,933,67,2.1,2.2000000000000002,1.3,0.7,18,89,55,40,75,93,80,60]
[65,"Senf, Weisser, Samen, getoastet",1000,10.7,11.7,105,210,59,249,344,278,95,232,45,949,51,5.0999999999999996,9,3.1,0.1,8,81,87,89,54,74,75,70]
[66,"Sojabohne, Samen ",1000,9.8000000000000007,10.6,120,255,74,317,407,196,60,284,82,947,53,2.8,6.3,3,0.2,18,83,85,90,60,80,80,80]
[67,"Sojabohne, Samen, extrudiert",1000,9.6999999999999993,10.5,153,269,67,275,413,190,54,281,77,938,62,2.7,6.4,3.1,0.1,19,83,85,90,60,80,70,80]
[68,"Sojabohnenschalen ",1000,6.7,6.9,102,82,96,72,130,24,373,420,26,947,53,5.5,1.8,2,0.1,13,79,60,75,80,85,60,70]
[69,"Soja-Extraktionsschrot, nicht entschält 44% RP",1000,7.8,8.3000000000000007,261,368,87,283,499,20,65,340,105,924,76,3.6,7.7,3.6,0.4,22,90,91,52,80,93,61,95]
[70,"Soja-Extraktionsschrot, teilentschält 48% RP",1000,7.9,8.4,277,398,86,306,539,17,53,322,102,931,69,3.5,7.4,3.1,0.2,24,90,91,52,80,93,61,95]
[71,"Sojakuchen, nicht entschält",1000,8.6999999999999993,9.4,249,349,84,268,473,71,62,322,99,928,72,3.1,6.8,3.2,0.2,22,90,91,90,70,93,61,95]
[72,"Sonnenblume,Samen ",1000,9.9,10.6,58,123,37,153,197,325,261,181,52,964,36,2.4,5.5,2.8,0.1,8,64,80,96,18,55,80,80]
[74,"Sonnenblumen-Extraktions- schrot, nicht entschält",1000,4.0999999999999996,3.6,95,168,58,190,255,15,370,310,50,950,50,4.8,8.5,5,0.3,13,52,84,68,30,50,77,90]
[73,"Sonnenblumen-Extraktions- schrot, teilentschält",1000,5.0999999999999996,4.8,125,235,67,266,357,22,257,292,77,928,72,3.9,9.4,5.2,0.3,15,62,85,70,32,60,77,90]
[75,"Sonnenblumenkuchen, teilentschält",1000,6.3,6.3,118,219,64,248,333,86,240,274,83,933,67,3.2,9.4,6.6,0.3,16,65,85,93,32,60,77,90]
[38,"Stärke, Getreide- ",1000,8.8000000000000007,10,69,13,99,13,19,1,4,968,0,992,8,0.3,1.4,0.2,2.1,1,94,60,60,30,95,70,90,967,75]
[91,"Stoppelrübe, ohne Blätter frisch",1000,6.4,6.9,81,79,96,103,133,15,117,615,353,880,120,5.9,5.8,0.7,3,46,82,83,74,93,80,80,65]
[112,"Strohmehl ",1000,3.3,2.8,45,21,53,19,34,15,438,458,16,945,55,3.7,1.2,1,2.9,14,44,"-","-","-","-",60,70]
[113,"Strohmehl mit Natronlauge aufgeschlossen",1000,3.9,3.5,54,21,65,19,33,12,428,452,16,925,75,3.6,1.1000000000000001,1,16.5,14,53,"-","-","-","-",60,70]
[158,"Teigwaren ",1000,8.4,9.3000000000000007,121,106,123,112,168,2,2,820,37,992,8,0.1,2.1,0.5,1.1000000000000001,2,91,85,82,47,92,70,75]
[102,"Trester, Apfel-, getrocknet",1000,5.4,5.4,65,17,81,7,61,23,224,665,218,973,27,1.3,1.4,0.6,0.1,6,66,40,39,49,75,20,25]
[103,"Trester, Apfel-, getrok- knet, entpektinisiert",1000,4.3,4,59,22,62,9,81,32,322,487,160,922,78,13.1,1.2,0.3,3.8,1,56,40,39,49,65,20,25]
[104,"Trester, Birnen-, getrocknet",1000,4.0999999999999996,3.7,53,16,64,6,55,11,346,574,188,986,14,1,0.9,0.3,0.3,4,53,40,39,35,65,20,25]
[105,"Trester, Trauben-, getrocknet",1000,2.9,2.2000000000000002,41,43,24,29,132,73,277,441,180,923,77,6.1,3,1.1000000000000001,0.1,17,36,13,49,37,40,30,25]
[106,"Trester, Zitrus-, getrocknet",1000,7.4,8.1,91,48,107,44,72,34,140,691,241,937,63,18.899999999999999,1.3,1.5,0.8,9,85,50,80,80,90,65,80]
[39,"Triticale, Körner ",1000,8.3000000000000007,9.1999999999999993,103,81,118,93,125,14,23,817,42,979,21,0.6,4.3,1.1000000000000001,0.1,5,90,75,72,33,94,77,85]
[124,"Vollmilch, frisch ",1000,13.4,15.5,102,164,80,197,253,309,0,383,365,945,55,9.3000000000000007,7.5,0.8,2.8,11,97,95,98,0,97,80,90]
[125,"Vollmilchpulver ",1000,12.3,14.2,111,179,87,215,276,250,0,412,378,938,62,9.9,7.9,0.8,3.3,15,96,94,98,0,97,80,90]
[40,"Weizen, Körner ",1000,8.5,9.5,115,99,119,106,147,15,24,795,32,981,19,0.5,4.4000000000000004,1.2,0.1,4,91,78,83,51,95,75,94]
[41,"Weizen, Körner gekeimt (Auswuchsweizen)",1000,7.6,8.1999999999999993,98,93,109,111,147,13,24,797,32,981,19,0.5,4.4000000000000004,1.2,0.1,3,83,72,76,35,87,78,80]
[44,"Weizenbollmehl ",1000,7.1,7.6,99,116,98,139,184,39,72,664,65,959,41,1.2,8.5,2.8,0.1,7,79,81,75,33,83,78,80]
[43,"Weizenfuttermehl dunkel ",1000,7.6,8.1999999999999993,102,124,100,149,197,52,50,660,64,959,41,1.2,8.8000000000000007,2.9,0.1,9,82,81,75,33,86,78,80]
[46,"Weizenkeime ",1000,9.4,10.4,123,201,99,246,325,106,27,492,128,950,50,0.8,12.4,3.1,0.1,11,91,90,90,40,94,78,75]
[47,"Weizenkleber ",1000,9.1999999999999993,9.8000000000000007,255,545,102,617,854,11,4,121,4,990,10,1,2.2000000000000002,0.5,0.1,1,96,96,90,40,97,75,80]
[45,"Weizenkleie ",1000,6.1,6.3,101,118,83,121,181,38,112,603,66,934,66,1.5,14,4.7,0.1,13,71,78,69,31,76,70,80]
[42,"Weizennachmehl (Weizenfuttermehl, hell)",1000,8.9,10,114,116,121,139,184,28,9,760,74,981,19,0.5,4.5,1.4,0.1,4,93,85,82,47,96,78,80]
[80,"Wicke, Samen ",1000,8.1,8.8000000000000007,143,189,106,199,298,14,69,581,46,962,38,1.6,5,1.8,0.2,10,89,87,86,59,94,70,75]
[93,"Zichorienwurzeln frisch ",1000,7.1,7.7,77,52,105,73,88,18,108,688,131,902,98,5,2.6,1.3,0.7,20,86,71,60,77,90,85,65]
[98,"Zucker, Futter- (Saccharose)",1000,9.4,10.9,91,0,142,0,0,0,0,978,978,978,22,0.4,0.2,0,0.1,1,100,0,0,0,100,"-","-"]
[94,"Zuckerrübe frisch ",1000,7.4,8.1999999999999993,84,33,120,44,57,2,47,827,676,933,67,2.1,1.5,1.3,0.7,9,90,55,30,75,93,80,60]
[97,"Zuckerrübenmelasse ",1000,7.6,8.5,76,74,118,128,128,0,0,757,625,885,115,1.5,0.1,0.2,5.7,40,92,75,0,0,95,100,0]
[95,"Zuckerrübenschnitzel, getrocknet",1000,7.2,7.7,116,72,108,46,103,10,209,621,66,943,57,7.8,1,2.1,1.8,7,85,60,30,80,92,50,80]
[96,"Zuckerrübenschnitzel, siliert",1000,7.1,7.7,101,70,108,53,106,10,215,612,18,943,57,7.5,1.2,2.6,1.8,7,85,60,30,80,92,55,75]

{"sheet":"FORMULE","index":5,"n_rows":70,"n_cols":8,"rows_kept":70,"cut":false,"hidden":false,"merged":[]}
[{"$f":"EXPORT!A1","v":"aliments"},{"$f":"IF('Aliments Futtermittel'!H42=1,\"mélange ZZ\",\"Mischung ZZ\")","v":"mélange ZZ"}]
[]
[null,{"$f":"EXPORT!BC1","v":"NEL dans mélange"},{"$f":"IF(EXPORT!BC3=0,\"\",EXPORT!BC3)","v":""},{"$f":"'Aliments Futtermittel'!K4","v":"MJ/kg MS"},{"$f":"'Aliments Futtermittel'!L4","v":"énergie nette lait"},null,null,{"$f":"IF('Aliments Futtermittel'!$H$42=1,\"% du mélange\",\"% in der Mischung\")","v":"% du mélange"}]
[null,{"$f":"EXPORT!BD1","v":"NEV dans mélange"},{"$f":"IF(EXPORT!BD3=0,\"\",EXPORT!BD3)","v":""},{"$f":"'Aliments Futtermittel'!K5","v":"MJ/kg MS"},{"$f":"'Aliments Futtermittel'!L5","v":"énergie nette viande"},null,{"$f":"'Aliments Futtermittel'!E6","v":"dMO"},{"$f":"EXPORT!AU3","v":0}]
[null,{"$f":"EXPORT!BE1","v":"PAIE dans mélange"},{"$f":"IF(EXPORT!BE3=0,\"\",EXPORT!BE3)","v":""},{"$f":"'Aliments Futtermittel'!K6","v":"g/kg MS"},{"$f":"'Aliments Futtermittel'!L6","v":"protéines absorbables dans l'intestin synthétisées à partir de l'énergie disponible"},null,{"$f":"'Aliments Futtermittel'!E7","v":"dMA"},{"$f":"EXPORT!AV3","v":0}]
[null,{"$f":"EXPORT!BF1","v":"PAIN dans mélange"},{"$f":"IF(EXPORT!BF3=0,\"\",EXPORT!BF3)","v":""},{"$f":"'Aliments Futtermittel'!K7","v":"g/kg MS"},{"$f":"'Aliments Futtermittel'!L7","v":"protéines absorbables dans l'intestin, synthétisées à partir de la matière azotée dégradée"},null,{"$f":"'Aliments Futtermittel'!E8","v":"dMG"},{"$f":"EXPORT!AW3","v":0}]
[null,null,null,null,null,null,{"$f":"'Aliments Futtermittel'!E9","v":"dCB"},{"$f":"EXPORT!AX3","v":0}]
[null,null,{"$f":"C29","v":0},{"$f":"IF(C8>100,\" >100% !!!\",IF(C8<100,\"<100% !!!\",D29))","v":"<100% !!!"},null,null,{"$f":"'Aliments Futtermittel'!E10","v":"dENA"},{"$f":"EXPORT!AY3","v":0}]
[1,{"$f":"IF(EXPORT!A5=\"\",\"\",EXPORT!A5)","v":""},null,{"$f":"IF(B9<>\"\",EXPORT!$B$1,\"\")","v":""},{"$f":"IF(B9<>\"\",IF(F9=\"table\",IF('Aliments Futtermittel'!$H$42=1,\" ! valeurs des tables !\",\" ! Tabellenwerte !\"),\"\"),\"\")","v":""},{"$f":"IFERROR(EXPORT!U5,\"table\")","v":0},{"$f":"'Aliments Futtermittel'!E11","v":"deMA"},{"$f":"EXPORT!AZ3","v":0}]
[2,{"$f":"IF(EXPORT!A6=\"\",\"\",EXPORT!A6)","v":""},null,{"$f":"IF(B10<>\"\",EXPORT!$B$1,\"\")","v":""},{"$f":"IF(B10<>\"\",IF(F10=\"table\",IF('Aliments Futtermittel'!$H$42=1,\" ! valeurs des tables !\",\" ! Tabellenwerte !\"),\"\"),\"\")","v":""},{"$f":"IFERROR(EXPORT!U6,\"table\")","v":0},{"$f":"'Aliments Futtermittel'!E12","v":"dAAA"},{"$f":"EXPORT!BA3","v":0}]
[3,{"$f":"IF(EXPORT!A7=\"\",\"\",EXPORT!A7)","v":""},null,{"$f":"IF(B11<>\"\",EXPORT!$B$1,\"\")","v":""},{"$f":"IF(B11<>\"\",IF(F11=\"table\",IF('Aliments Futtermittel'!$H$42=1,\" ! valeurs des tables !\",\" ! Tabellenwerte !\"),\"\"),\"\")","v":""},{"$f":"IFERROR(EXPORT!U7,\"table\")","v":0},{"$f":"'Aliments Futtermittel'!E13","v":"deAM"},{"$f":"EXPORT!BB3","v":0}]
[4,{"$f":"IF(EXPORT!A8=\"\",\"\",EXPORT!A8)","v":""},null,{"$f":"IF(B12<>\"\",EXPORT!$B$1,\"\")","v":""},{"$f":"IF(B12<>\"\",IF(F12=\"table\",IF('Aliments Futtermittel'!$H$42=1,\" ! valeurs des tables !\",\" ! Tabellenwerte !\"),\"\"),\"\")","v":""},{"$f":"IFERROR(EXPORT!U8,\"table\")","v":0}]
[5,{"$f":"IF(EXPORT!A9=\"\",\"\",EXPORT!A9)","v":""},null,{"$f":"IF(B13<>\"\",EXPORT!$B$1,\"\")","v":""},{"$f":"IF(B13<>\"\",IF(F13=\"table\",IF('Aliments Futtermittel'!$H$42=1,\" ! valeurs des tables !\",\" ! Tabellenwerte !\"),\"\"),\"\")","v":""},{"$f":"IFERROR(EXPORT!U9,\"table\")","v":0}]
[6,{"$f":"IF(EXPORT!A10=\"\",\"\",EXPORT!A10)","v":""},null,{"$f":"IF(B14<>\"\",EXPORT!$B$1,\"\")","v":""},{"$f":"IF(B14<>\"\",IF(F14=\"table\",IF('Aliments Futtermittel'!$H$42=1,\" ! valeurs des tables !\",\" ! Tabellenwerte !\"),\"\"),\"\")","v":""},{"$f":"IFERROR(EXPORT!U10,\"table\")","v":0}]
[7,{"$f":"IF(EXPORT!A11=\"\",\"\",EXPORT!A11)","v":""},null,{"$f":"IF(B15<>\"\",EXPORT!$B$1,\"\")","v":""},{"$f":"IF(B15<>\"\",IF(F15=\"table\",IF('Aliments Futtermittel'!$H$42=1,\" ! valeurs des tables !\",\" ! Tabellenwerte !\"),\"\"),\"\")","v":""},{"$f":"IFERROR(EXPORT!U11,\"table\")","v":0}]
[8,{"$f":"IF(EXPORT!A12=\"\",\"\",EXPORT!A12)","v":""},null,{"$f":"IF(B16<>\"\",EXPORT!$B$1,\"\")","v":""},{"$f":"IF(B16<>\"\",IF(F16=\"table\",IF('Aliments Futtermittel'!$H$42=1,\" ! valeurs des tables !\",\" ! Tabellenwerte !\"),\"\"),\"\")","v":""},{"$f":"IFERROR(EXPORT!U12,\"table\")","v":0}]
[9,{"$f":"IF(EXPORT!A13=\"\",\"\",EXPORT!A13)","v":""},null,{"$f":"IF(B17<>\"\",EXPORT!$B$1,\"\")","v":""},{"$f":"IF(B17<>\"\",IF(F17=\"table\",IF('Aliments Futtermittel'!$H$42=1,\" ! valeurs des tables !\",\" ! Tabellenwerte !\"),\"\"),\"\")","v":""},{"$f":"IFERROR(EXPORT!U13,\"table\")","v":0}]
[10,{"$f":"IF(EXPORT!A14=\"\",\"\",EXPORT!A14)","v":""},null,{"$f":"IF(B18<>\"\",EXPORT!$B$1,\"\")","v":""},{"$f":"IF(B18<>\"\",IF(F18=\"table\",IF('Aliments Futtermittel'!$H$42=1,\" ! valeurs des tables !\",\" ! Tabellenwerte !\"),\"\"),\"\")","v":""},{"$f":"IFERROR(EXPORT!U14,\"table\")","v":0}]
[11,{"$f":"IF(EXPORT!A15=\"\",\"\",EXPORT!A15)","v":""},null,{"$f":"IF(B19<>\"\",EXPORT!$B$1,\"\")","v":""},{"$f":"IF(B19<>\"\",IF(F19=\"table\",IF('Aliments Futtermittel'!$H$42=1,\" ! valeurs des tables !\",\" ! Tabellenwerte !\"),\"\"),\"\")","v":""},{"$f":"IFERROR(EXPORT!U15,\"table\")","v":0}]
[12,{"$f":"IF(EXPORT!A16=\"\",\"\",EXPORT!A16)","v":""},null,{"$f":"IF(B20<>\"\",EXPORT!$B$1,\"\")","v":""},{"$f":"IF(B20<>\"\",IF(F20=\"table\",IF('Aliments Futtermittel'!$H$42=1,\" ! valeurs des tables !\",\" ! Tabellenwerte !\"),\"\"),\"\")","v":""},{"$f":"IFERROR(EXPORT!U16,\"table\")","v":0}]
[13,{"$f":"IF(EXPORT!A17=\"\",\"\",EXPORT!A17)","v":""},null,{"$f":"IF(B21<>\"\",EXPORT!$B$1,\"\")","v":""},{"$f":"IF(B21<>\"\",IF(F21=\"table\",IF('Aliments Futtermittel'!$H$42=1,\" ! valeurs des tables !\",\" ! Tabellenwerte !\"),\"\"),\"\")","v":""},{"$f":"IFERROR(EXPORT!U17,\"table\")","v":0}]
[14,{"$f":"IF(EXPORT!A18=\"\",\"\",EXPORT!A18)","v":""},null,{"$f":"IF(B22<>\"\",EXPORT!$B$1,\"\")","v":""},{"$f":"IF(B22<>\"\",IF(F22=\"table\",IF('Aliments Futtermittel'!$H$42=1,\" ! valeurs des tables !\",\" ! Tabellenwerte !\"),\"\"),\"\")","v":""},{"$f":"IFERROR(EXPORT!U18,\"table\")","v":0}]
[15,{"$f":"IF(EXPORT!A19=\"\",\"\",EXPORT!A19)","v":""},null,{"$f":"IF(B23<>\"\",EXPORT!$B$1,\"\")","v":""},{"$f":"IF(B23<>\"\",IF(F23=\"table\",IF('Aliments Futtermittel'!$H$42=1,\" ! valeurs des tables !\",\" ! Tabellenwerte !\"),\"\"),\"\")","v":""},{"$f":"IFERROR(EXPORT!U19,\"table\")","v":0}]
[16,{"$f":"IF(EXPORT!A20=\"\",\"\",EXPORT!A20)","v":""},null,{"$f":"IF(B24<>\"\",EXPORT!$B$1,\"\")","v":""},{"$f":"IF(B24<>\"\",IF(F24=\"table\",IF('Aliments Futtermittel'!$H$42=1,\" ! valeurs des tables !\",\" ! Tabellenwerte !\"),\"\"),\"\")","v":""},{"$f":"IFERROR(EXPORT!U20,\"table\")","v":0}]
[17,{"$f":"IF(EXPORT!A21=\"\",\"\",EXPORT!A21)","v":""},null,{"$f":"IF(B25<>\"\",EXPORT!$B$1,\"\")","v":""},{"$f":"IF(B25<>\"\",IF(F25=\"table\",IF('Aliments Futtermittel'!$H$42=1,\" ! valeurs des tables !\",\" ! Tabellenwerte !\"),\"\"),\"\")","v":""},{"$f":"IFERROR(EXPORT!U21,\"table\")","v":0}]
[18,{"$f":"IF(EXPORT!A22=\"\",\"\",EXPORT!A22)","v":""},null,{"$f":"IF(B26<>\"\",EXPORT!$B$1,\"\")","v":""},{"$f":"IF(B26<>\"\",IF(F26=\"table\",IF('Aliments Futtermittel'!$H$42=1,\" ! valeurs des tables !\",\" ! Tabellenwerte !\"),\"\"),\"\")","v":""},{"$f":"IFERROR(EXPORT!U22,\"table\")","v":0}]
[19,{"$f":"IF(EXPORT!A23=\"\",\"\",EXPORT!A23)","v":""},null,{"$f":"IF(B27<>\"\",EXPORT!$B$1,\"\")","v":""},{"$f":"IF(B27<>\"\",IF(F27=\"table\",IF('Aliments Futtermittel'!$H$42=1,\" ! valeurs des tables !\",\" ! Tabellenwerte !\"),\"\"),\"\")","v":""},{"$f":"IFERROR(EXPORT!U23,\"table\")","v":0}]
[20,{"$f":"IF(EXPORT!A24=\"\",\"\",EXPORT!A24)","v":""},null,{"$f":"IF(B28<>\"\",EXPORT!$B$1,\"\")","v":""},{"$f":"IF(B28<>\"\",IF(F28=\"table\",IF('Aliments Futtermittel'!$H$42=1,\" ! valeurs des tables !\",\" ! Tabellenwerte !\"),\"\"),\"\")","v":""},{"$f":"IFERROR(EXPORT!U24,\"table\")","v":0},null,"yves.arrigo@agroscope.admin.ch"]
[null,{"$f":"IF(EXPORT!A250=\"\",\"\",EXPORT!A250)","v":""},{"$f":"SUM(C9:C28)","v":0},{"$f":"EXPORT!B1","v":"% dans le mélange"}]
[null,{"$f":"IF(EXPORT!A251=\"\",\"\",EXPORT!A251)","v":""},null,{"$f":"IF(B30<>\"\",EXPORT!$B$1,\"\")","v":""}]
[null,{"$f":"IF(EXPORT!A252=\"\",\"\",EXPORT!A252)","v":""},null,{"$f":"IF(B31<>\"\",EXPORT!$B$1,\"\")","v":""}]
[]
[]
[{"$f":"A1","v":"aliments"},null,{"$f":"IF(B1=\"\",\"\",B1)","v":"mélange ZZ"},null,null,{"$f":"F1","v":0}]
[null,null,null,null,null,{"$f":"F2","v":0}]
[null,{"$f":"B3","v":"NEL dans mélange"},{"$f":"C3","v":""},"MJ/kg MS","énergie nette lait",0]
[null,{"$f":"B4","v":"NEV dans mélange"},{"$f":"C4","v":""},"MJ/kg MS","énergie nette viande",0]
[null,{"$f":"B5","v":"PAIE dans mélange"},{"$f":"C5","v":""},"g/kg MS","protéines absorbables dans l'intestin synthétisées à partir de l'énergie disponible",0]
[null,{"$f":"B6","v":"PAIN dans mélange"},{"$f":"C6","v":""},"g/kg MS","protéines absorbables dans l'intestin, synthétisées à partir de la matière azotée dégradée",0]
[null,null,null,null,null,{"$f":"F7","v":0}]
[null,null,null,null,null,{"$f":"F8","v":0}]
[{"$f":"A9","v":1},"",{"$f":"IF(C9=\"\",\"\",C9)","v":""},"","",0]
[{"$f":"A10","v":2},"",{"$f":"IF(C10=\"\",\"\",C10)","v":""},"",{"$f":"H3","v":"% du mélange"},0]
[{"$f":"A11","v":3},"","","",{"$f":"CONCATENATE(G4,\" \",H4,\" %\")","v":"dMO 0 %"},0]
[{"$f":"A12","v":4},"","","",{"$f":"CONCATENATE(G5,\" \",H5,\" %\")","v":"dMA 0 %"},0]
[{"$f":"A13","v":5},"","","","dMG 0 %",0]
[{"$f":"A14","v":6},"","","","dCB 0 %",0]
[{"$f":"A15","v":7},"","","","dENA 0 %",0]
[{"$f":"A16","v":8},"","","","deMA 0 %",0]
[{"$f":"A17","v":9},"","","","dAAA 0 %",0]
[{"$f":"A18","v":10},"","","","deAM 0 %",0]
[{"$f":"A19","v":11},"","","",null,0]
[{"$f":"A20","v":12},"","","",null,0]
[{"$f":"A21","v":13},"","","",null,0]
[{"$f":"A22","v":14},"","","","",0]
[{"$f":"A23","v":15},"","","","",0]
[{"$f":"A24","v":16},"","","","",0]
[{"$f":"A25","v":17},"","","","",0]
[{"$f":"A26","v":18},"","","","",0]
[{"$f":"A27","v":19},"","","","",0]
[{"$f":"A28","v":20},{"$f":"B28","v":""},"",{"$f":"D28","v":""},"",0]
[null,{"$f":"B29","v":""},{"$f":"IF(C29=\"\",\"\",C29)","v":0},"% dans le mélange",null,0]
[]
[]
[]
[]
[]
[]
[]
["Yves.Arrigo@alp.admin.ch"]

{"sheet":"EXPORT","index":6,"n_rows":23,"n_cols":85,"rows_kept":23,"cut":false,"hidden":false,"merged":[]}
[{"$f":"'Aliments Futtermittel'!A84","v":"aliments"},{"$f":"'Aliments Futtermittel'!B84","v":"% dans le mélange"},{"$f":"'Aliments Futtermittel'!C84","v":"MS"},{"$f":"'Aliments Futtermittel'!D84","v":"MA"},{"$f":"'Aliments Futtermittel'!E84","v":"MG"},{"$f":"'Aliments Futtermittel'!F84","v":"CB"},{"$f":"'Aliments Futtermittel'!G84","v":"CE"},{"$f":"'Aliments Futtermittel'!H84","v":"ENA"},{"$f":"'Aliments Futtermittel'!I84","v":"MO"},{"$f":"'Aliments Futtermittel'!J84","v":"MDS"},{"$f":"'Aliments Futtermittel'!K84","v":"AM"},{"$f":"'Aliments Futtermittel'!L84","v":"Pf"},{"$f":"'Aliments Futtermittel'!M84","v":"dMO"},{"$f":"'Aliments Futtermittel'!N84","v":"dMA"},{"$f":"'Aliments Futtermittel'!O84","v":"dMG"},{"$f":"'Aliments Futtermittel'!P84","v":"dCB"},{"$f":"'Aliments Futtermittel'!Q84","v":"dENA"},{"$f":"'Aliments Futtermittel'!R84","v":"deMA"},{"$f":"'Aliments Futtermittel'!S84","v":"dAAA"},{"$f":"'Aliments Futtermittel'!T84","v":"deAM"},{"$f":"'Aliments Futtermittel'!U84","v":"NEL"},{"$f":"'Aliments Futtermittel'!V84","v":"NEV"},{"$f":"'Aliments Futtermittel'!W84","v":"PAIE"},{"$f":"'Aliments Futtermittel'!X84","v":"PAIN"},{"$f":"'Aliments Futtermittel'!Y84","v":"PME"},{"$f":"'Aliments Futtermittel'!Z84","v":"PMN"},{"$f":"'Aliments Futtermittel'!AA84","v":"PAIA"},{"$f":"'Aliments Futtermittel'!AB84","v":"PAIM"},{"$f":"'Aliments Futtermittel'!AC84","v":"PAIMN"},{"$f":"'Aliments Futtermittel'!AD84","v":"EM"},{"$f":"'Aliments Futtermittel'!AE84","v":"EB"},{"$f":"'Aliments Futtermittel'!AF84","v":"NEL réf."},{"$f":"'Aliments Futtermittel'!AG84","v":"NEV réf."},{"$f":"'Aliments Futtermittel'!AH84","v":"PAIE réf."},{"$f":"'Aliments Futtermittel'!AI84","v":"PAIN réf."},{"$f":"IF('Aliments Futtermittel'!H42=1,\" dans mélange\",\" in der Mischung\")","v":" dans mélange"},{"$f":"CONCATENATE(C1,$AJ$1)","v":"MS dans mélange"},"MA dans mélange","MG dans mélange","CB dans mélange","CE dans mélange","ENA dans mélange","MO dans mélange","MDS dans mélange","AM dans mélange","Pf dans mélange","dMO dans mélange","dMA dans mélange","dMG dans mélange","dCB dans mélange","dENA dans mélange","deMA dans mélange","dAAA dans mélange","deAM dans mélange","NEL dans mélange","NEV dans mélange","PAIE dans mélange","PAIN dans mélange","PME dans mélange","PMN dans mélange","PAIA dans mélange","PAIM dans mélange","PAIMN dans mélange","EM dans mélange","EB dans mélange","NEL réf. dans mélange","NEV réf. dans mélange","PAIE réf. dans mélange","PAIN réf. dans mélange","MOD","MAD","MGD","CBD","ENAD","MADEG","AAAD","AMDEG","MOD%pond.","MAD%pond.","MGD%pond.","CBD%pond.","ENAD%pond.","MADEG%pond","AAAD%mél","AMDEG%pond"]
[null,null,null,null,null,null,null,null,null,null,null,null,null,null,null,null,null,null,null,null,null,null,null,null,null,null,null,null,null,null,null,null,null,null,null,{"$f":"B2/100","v":0},{"$f":"AJ2*C2","v":0},{"$f":"AJ2*D2","v":0},{"$f":"AJ2*E2","v":0},{"$f":"AJ2*F2","v":0},{"$f":"AJ2*G2","v":0},{"$f":"AJ2*H2","v":0},{"$f":"AJ2*I2","v":0},{"$f":"AJ2*J2","v":0},{"$f":"AJ2*K2","v":0},{"$f":"AJ2*L2","v":0},{"$f":"M2*BZ2","v":{"$error":"#DIV/0!"}},{"$error":"#DIV/0!"},{"$error":"#DIV/0!"},{"$error":"#DIV/0!"},{"$error":"#DIV/0!"},{"$error":"#DIV/0!"},{"$f":"AJ2*S2","v":0},{"$f":"T2*CG2","v":0},{"$f":"IFERROR(U2,AF2)*AJ2","v":0},{"$f":"IFERROR(V2,AG2)*AJ2","v":0},{"$f":"IFERROR(W2,AH2)*AJ2","v":0},{"$f":"IFERROR(X2,AI2)*AJ2","v":0},{"$f":"AJ2*Y2","v":0},{"$f":"AJ2*Z2","v":0},{"$f":"AJ2*AA2","v":0},{"$f":"AJ2*AB2","v":0},{"$f":"AJ2*AC2","v":0},{"$f":"IFERROR(AD2,AO2)*AP2","v":0},{"$f":"AJ2*AE2","v":0},{"$f":"AJ2*AF2","v":0},{"$f":"AJ2*AG2","v":0},{"$f":"AJ2*AH2","v":0},{"$f":"AJ2*AI2","v":0},{"$f":"AQ2*M2/100","v":0},{"$f":"AL2*N2/100","v":0},{"$f":"AM2*O2/100","v":0},{"$f":"AN2*P2/100","v":0},{"$f":"AP2*Q2/100","v":0},{"$f":"AL2*R2/100","v":0},null,{"$f":"AS2*T2/100","v":0},{"$f":"BR2/$BR$3","v":{"$error":"#DIV/0!"}},{"$f":"BS2/$BS$3","v":{"$error":"#DIV/0!"}},{"$f":"BT2/$BT$3","v":{"$error":"#DIV/0!"}},{"$f":"BU2/$BU$3","v":{"$error":"#DIV/0!"}},{"$f":"BV2/$BV$3","v":{"$error":"#DIV/0!"}},{"$f":"BW2/$BW$3","v":{"$error":"#DIV/0!"}},null,{"$f":"IFERROR(BY2/$BY$3,0)","v":0}]
[null,{"$f":"CONCATENATE(SUM(B5:B24),B1)","v":"0% dans le mélange"},null,null,null,null,null,null,null,null,null,null,null,null,null,null,null,null,null,null,null,null,null,null,null,null,null,null,null,null,null,null,null,null,null,null,{"$f":"SUM(AK5:AK24)","v":0},{"$f":"SUM(AL5:AL24)","v":0},0,0,0,0,0,0,0,0,0,0,0,0,0,0,0,0,0,0,0,0,0,0,0,0,0,0,0,0,0,0,0,0,0,0,0,0,0,0,0,0,0,0,0,0,0,0,0]
[{"$f":"A1","v":"aliments"},{"$f":"B3","v":"0% dans le mélange"},{"$f":"C1","v":"MS"},"MA","MG","CB","CE","ENA","MO","MDS","AM","Pf","dMO","dMA","dMG","dCB","dENA","deMA","dAAA","deAM","NEL","NEV","PAIE","PAIN","PME","PMN","PAIA","PAIM","PAIMN","EM","EB","NEL réf.","NEV réf.","PAIE réf.","PAIN réf."," dans mélange",{"$f":"AK1","v":"MS dans mélange"},{"$f":"AL1","v":"MA dans mélange"},{"$f":"AM1","v":"MG dans mélange"},{"$f":"AN1","v":"CB dans mélange"},{"$f":"AO1","v":"CE dans mélange"},{"$f":"AP1","v":"ENA dans mélange"},{"$f":"AQ1","v":"MO dans mélange"},{"$f":"AR1","v":"MDS dans mélange"},{"$f":"AS1","v":"AM dans mélange"},{"$f":"AT1","v":"Pf dans mélange"},{"$f":"AU1","v":"dMO dans mélange"},{"$f":"AV1","v":"dMA dans mélange"},{"$f":"AW1","v":"dMG dans mélange"},{"$f":"AX1","v":"dCB dans mélange"},{"$f":"AY1","v":"dENA dans mélange"},{"$f":"AZ1","v":"deMA dans mélange"},{"$f":"BA1","v":"dAAA dans mélange"},{"$f":"BB1","v":"deAM dans mélange"},{"$f":"BC1","v":"NEL dans mélange"},{"$f":"BD1","v":"NEV dans mélange"},{"$f":"BE1","v":"PAIE dans mélange"},{"$f":"BF1","v":"PAIN dans mélange"},{"$f":"BG1","v":"PME dans mélange"},{"$f":"BH1","v":"PMN dans mélange"},{"$f":"BI1","v":"PAIA dans mélange"},{"$f":"BJ1","v":"PAIM dans mélange"},{"$f":"BK1","v":"PAIMN dans mélange"},{"$f":"BL1","v":"EM dans mélange"},{"$f":"BM1","v":"EB dans mélange"},{"$f":"BN1","v":"NEL réf. dans mélange"},{"$f":"BO1","v":"NEV réf. dans mélange"},{"$f":"BP1","v":"PAIE réf. dans mélange"},{"$f":"BQ1","v":"PAIN réf. dans mélange"},"MOD","MAD","MGD","CBD","ENAD","MADEG","AAAD","AMDEG","MOD%pond.","MAD%pond.","MGD%pond.","CBD%pond.","ENAD%pond.","MADEG%pond","AAAD%mél","AMDEG%pond"]
[]
[]
[null,{"$f":"FORMULE!C11","v":0}]
[null,{"$f":"FORMULE!C12","v":0}]
[null,{"$f":"FORMULE!C13","v":0}]
[null,{"$f":"FORMULE!C14","v":0}]
[null,{"$f":"FORMULE!C15","v":0}]
[null,{"$f":"FORMULE!C16","v":0}]
[null,{"$f":"FORMULE!C17","v":0}]
[null,{"$f":"FORMULE!C18","v":0}]
[null,{"$f":"FORMULE!C19","v":0}]
[null,{"$f":"FORMULE!C20","v":0}]
[null,{"$f":"FORMULE!C21","v":0}]
[null,{"$f":"FORMULE!C22","v":0}]
[null,{"$f":"FORMULE!C23","v":0}]
[null,{"$f":"FORMULE!C24","v":0}]
[null,{"$f":"FORMULE!C25","v":0}]
[null,{"$f":"FORMULE!C26","v":0}]
[null,{"$f":"FORMULE!C27","v":0}]

{"sheet":"Trad. Uebersetz.","index":7,"n_rows":191,"n_cols":5,"rows_kept":191,"cut":false,"hidden":false,"merged":[]}
["Aliment","Einzelfuttermittel",null,"Einzelfuttermittel","Aliment"]
[]
["Amidon de blé","Weizenstärke",null,"Ackerbohne, Samen","Féverole, graine "]
["Amidon de céréales ","Stärke, Getreide-",null,"Apfel frisch","Pomme, fruit "]
["Arachide, tourteau de pression","Erdnusskuchen",null,"Apfeltrester getrocknet, entpektinisiert","Marc de pommes, dépectinisé, séché"]
["Arachide, tourteau de pression, décortiquée","Erdnusskuchen entschälter Saat",null,"Apfeltrester getrocknet, nicht entpektinisiert","Marc de pommes, séché "]
["Arachide, tourteau d'extraction, décortiquée","Erdnuss-Extraktionsschrot a. entschälter Saat",null,"Auswuchsweizen","Blé germé, grain "]
["Avoine floconnée non décortiquée","Hafer flockiert nicht entspelzt",null,"Backabfälle (Brotabfälle)","Boulangerie, déchets "]
["Avoine floconnée partiellement décortiquée","Hafer flockiert teilentspelzt",null,"Baumwollextraktionsschrot, nicht entschält","Coton, tourteau d'extraction, non décortiqué"]
["Avoine, balles ","Haferspelzen",null,"Baumwollextraktionsschrot, teilentschält","Coton, tourteau d'extraction, partiel. décortiqué"]
["Avoine, farine de déchets (issues)","Haferabfallmehl",null,"Baumwollsamen, ganz {Baumwollsaat)","Coton, graine "]
["Avoine, farine fourragère ","Haferfuttermehl",null,"Bierhefe getrocknet","Levure de brasserie, séchée"]
["Avoine, flocons ","Haferflocken",null,"Biertreber frisch ","Drêches de brasserie, fraîches"]
["Avoine, grain","Hafer, Körner",null,"Biertreber getrocknet ","Drêches de brasserie, séchées"]
["Avoine, grain décortiqué","Hafer, Körner entspelzt",null,"Biertreber siliert ","Drêches de brasserie, ensilées"]
["Avoine, grain, léger (42-49 kg/hl)","Hafer, Körner leicht(42-49 kg/hl)",null,"Birne frisch","Poire, fruit "]
["Avoine, grain, moyen à lourd (50-57 kg/hl)","Hafer, mittel bisvollkörnig (50-57 kg/hl)",null,"Birnentrester getrocknet","Marc de poires, séché "]
["Babeurre frais ","Buttermilch frisch",null,"Blutmehl","Sang, farine "]
["Babeurre, poudre ","Buttermilchpulver",null,"Bohne, Samen, getoastet","Haricot toasté, graine "]
["Betterave fourragère, fraîche","Futterrübe",null,"Bruchreis","Riz, brisures "]
["Betterave sucrière, fraîche ","Zuckerrübe frisch",null,"Buttermilch frisch","Babeurre frais "]
["Betteraves, pulpe, ensilée","Zuckerrübenschnitzel siliert",null,"Buttermilchpulver","Babeurre, poudre "]
["Betteraves, pulpe, séchée","Zuckerrübenschnitzel getrocknet",null,"Ca-Kaseinpulver","Poudre de caséine riche en Ca"]
["Blé fourrager, grain","Futterweizen, Körner",null,"Ca-Propionat","Propionate de calcium "]
["Blé germé, grain ","Auswuchsweizen",null,"Dextrose","Lactose "]
["Blé grain expandé","Weizen, Körner expandiert",null,"Dinkel, Körner","Epeautre, grain "]
["Blé, farine fourragère 1re (claire)","Weizenfuttermehl hell",null,"Dinkelspelzen","Epeautre, balles "]
["Blé, farine fourragère 2e (foncée)","Weizenfuttermehl dunkel",null,"Erdnuss-Extraktionsschrot a. entschälter Saat","Arachide, tourteau d'extraction, décortiquée"]
["Blé, germe ","Weizenkeime",null,"Erdnusskuchen","Arachide, tourteau de pression"]
["Blé, gluten ","Weizenkleber",null,"Erdnusskuchen entschälter Saat","Arachide, tourteau de pression, décortiquée"]
["Blé, grain ","Weizen, Körner",null,"Federmehl aufgeschlossen","Plumes hydrolysées, farine "]
["Blé, remoulage ","Weizenbollmehl",null,"Fett oder Öl,pflanzlicher Herkunft","Graisse ou huile végétale "]
["Blé, son ","Weizenkleie",null,"Fett, freie Fettsäuren","Graisse, mélange d'acides gras"]
["Boulangerie, déchets ","Backabfälle (Brotabfälle)",null,"Fett, Kalzium-Seife","Graisse saponifiée "]
["Cacao, pelures ","Kakaoschalen",null,"Fett, kristallines","Graisse cristalline "]
["Café, marc ","Kaffeeextraktionsabfälle",null,"Fett, tierisches","Graisse animale "]
["Carbonate de calcium ","Kalk, kohlensaurer",null,"Fischmehl 64 % RP","Poisson 64 % MA, farine "]
["Carotte rouge ","Rande, Knolle, frisch",null,"Fischmehl 70/72 % RP Heringtyp","Poisson 70/72 % MA, farine "]
["Carotte, racine ","Karotte, Wurzel frisch",null,"Fleischknochenmehl 40 % RP","Viande et os 40 % MA, farine"]
["Caroube, farine de gousses","Johannisbrot",null,"Fleischmehl 60% RP","Viande 60 % MA, farine "]
["Caséine, poudre ","Kaseinpulver",null,"Futterhefe","Levure fourragère 48 % MA, séchée (Torula)"]
["Choux-rave ","Kohlrübe, Wurzel frisch",null,"Futterkartoffel, Knolle frisch","Pomme de terre fourragère, crue"]
["Colza, graine ","Rapssamen 00-Typ",null,"Futterprotein Protorsan 70% RP","Protéine fourragère 70 % MA (protéine bactérienne)"]
["Colza, tourteau de presse, 4-9 % MG","Rapskuchen 4-9% RL",null,"Futterrübe","Betterave fourragère, fraîche"]
["Colza, tourteau de pression, > 9 % MG","Rapskuchen >9% RL",null,"Futterweizen, Körner","Blé fourrager, grain"]
["Colza, tourteau de pression, filière bio-diesel","Rapskuchen ausBio-Diesel",null,"Futterzucker","Sucre fourrager "]
["Colza, tourteau d'extraction","Raps-Extraktionsschrot",null,"Gerste, Körner leicht (55 - 61 kg/hl)","Orge, grain, léger (55-61 kg/hl)"]
["Coprah, tourteau d'extraction","Kokosextraktionsschrot",null,"Gerste, Körner mittel (62 - 69 kg/hl)","Orge, grain, moyen (62-69 kg/hl)"]
["Coton, graine ","Baumwollsamen, ganz {Baumwollsaat)",null,"Gerste, Körner vollkörnig (70 - 74 kg/hl)","Orge, grain, lourd (70-74 kg/hl)"]
["Coton, tourteau d'extraction, non décortiqué","Baumwollextraktionsschrot, nicht entschält",null,"Gerstenflocken","Orge, flocons "]
["Coton, tourteau d'extraction, partiel. décortiqué","Baumwollextraktionsschrot, teilentschält",null,"Gerstenfuttermehl","Orge, farine fourragère "]
["Cretons, farine ","Griebenmehl",null,"Gerstenschälmehl","Orge, issues "]
["Dextrose ","Laktose",null,"Grasmehl 13% RP,künstlich getrocknet","Herbe 13 % MA, farine, déshydratée"]
["Drêches de brasserie, ensilées","Biertreber siliert ",null,"Grasmehl 17% RP,künstlich getrocknet","Herbe 17 % MA, farine, déshydratée"]
["Drêches de brasserie, fraîches","Biertreber frisch ",null,"Griebenmehl","Cretons, farine "]
["Drêches de brasserie, séchées","Biertreber getrocknet ",null,"Hafer flockiert nicht entspelzt","Avoine floconnée non décortiquée"]
["Endive, racine ","Zichorienwurzeln frisch",null,"Hafer flockiert teilentspelzt","Avoine floconnée partiellement décortiquée"]
["Epeautre, balles ","Dinkelspelzen",null,"Hafer, Körner","Avoine, grain"]
["Epeautre, grain ","Dinkel, Körner",null,"Hafer, Körner entspelzt","Avoine, grain décortiqué"]
["Féverole, graine ","Ackerbohne, Samen",null,"Hafer, Körner leicht(42-49 kg/hl)","Avoine, grain, léger (42-49 kg/hl)"]
["Graine de tournesol non décortiquée > 24 % CB","Sonnenblumenkerne > 24 % RF, nicht entschält",null,"Hafer, mittel bisvollkörnig (50-57 kg/hl)","Avoine, grain, moyen à lourd (50-57 kg/hl)"]
["Graine de tournesol partiellement décortiquée 12 - 15 % CB","Sonnenblumenkerne 12 - 15 % RF, teilentschält",null,"Haferabfallmehl","Avoine, farine de déchets (issues)"]
["Graine de tournesol partiellement décortiquée 15 - 24 % CB","Sonnenblumenkerne 15 - 24 % RF, teilentschält",null,"Haferflocken","Avoine, flocons "]
["Graisse animale ","Fett, tierisches",null,"Haferfuttermehl","Avoine, farine fourragère "]
["Graisse cristalline ","Fett, kristallines",null,"Haferspelzen","Avoine, balles "]
["Graisse ou huile végétale ","Fett oder Öl,pflanzlicher Herkunft",null,"Harnstoff","Urée "]
["Graisse saponifiée ","Fett, Kalzium-Seife",null,"Hartkäsemolke","Lactosérum frais (petit-lait)"]
["Graisse, mélange d'acides gras","Fett, freie Fettsäuren",null,"Hirse, Körner 4-6% RF","Millet, grain, 4-6 % CB "]
["Haricot toasté, graine ","Bohne, Samen, getoastet",null,"Hirse, Körner unter 4% RF(Milocorn/Sorghum)","Millet, grain, < 4 % CB (milocorn, sorgho)"]
["Herbe 13 % MA, farine, déshydratée","Grasmehl 13% RP,künstlich getrocknet",null,"Johannisbrot","Caroube, farine de gousses"]
["Herbe 17 % MA, farine, déshydratée","Grasmehl 17% RP,künstlich getrocknet",null,"Kaffeeextraktionsabfälle","Café, marc "]
["Huile de foie de morue ","Lebertran",null,"Kakaoschalen","Cacao, pelures "]
["Lactose ","Dextrose",null,"Kalk, kohlensaurer","Carbonate de calcium "]
["Lactosérum concentré 12 % MS","Molkenkonzentrat 12 % TS",null,"Karotte, Wurzel frisch","Carotte, racine "]
["Lactosérum concentré 18 % MS","Molkenkonzentrat 18 % TS",null,"Kartoffel, Knolle frisch","Pomme de terre de consom- mation, crue"]
["Lactosérum concentré 25 % MS","Molkenkonzentrat 25 % TS",null,"Kartoffelflocken","Pommes de terre, flocons "]
["Lactosérum frais (petit-lait)","Hartkäsemolke",null,"Kartoffelmehl","Pommes de terre, farine "]
["Lactosérum, poudre (petit-lait)","Molkenpulver(Schottepulver)",null,"Kartoffelprotein","Pommes de terre, protéine "]
["Lait écrémé frais ","Magermilch frisch",null,"Kartoffelstärke","Pommes de terre, amidon "]
["Lait écrémé, poudre ","Magermilchpulver",null,"Kaseinpulver","Caséine, poudre "]
["Lait entier frais ","Vollmilch, Kuh, Winter, frisch",null,"Knochenmehl entleimt","Os dégélatinisés,  farine fourragère"]
["Lait entier, poudre ","Vollmilchpulver, Kuh",null,"Kohlrübe, Wurzel frisch","Choux-rave "]
["Levure de brasserie, séchée","Bierhefe getrocknet",null,"Kokosextraktionsschrot","Coprah, tourteau d'extraction"]
["Levure fourragère 48 % MA, séchée (Torula)","Futterhefe",null,"Laktose","Dextrose "]
["Lin, graine ","Leinsamen",null,"Lebertran","Huile de foie de morue "]
["Lin, tourteau de pression > 11 % MG","Leinkuchen > 11 % RL",null,"Leinextraktionsschrot","Lin, tourteau d'extraction "]
["Lin, tourteau de pression, 4-7 % MG","Leinkuchen 4-7% RL",null,"Leinkuchen > 11 % RL","Lin, tourteau de pression > 11 % MG"]
["Lin, tourteau de pression, 8-12 % MG","Leinkuchen 8 - 11 % RL",null,"Leinkuchen 4-7% RL","Lin, tourteau de pression, 4-7 % MG"]
["Lin, tourteau d'extraction ","Leinextraktionsschrot",null,"Leinkuchen 8 - 11 % RL","Lin, tourteau de pression, 8-12 % MG"]
["Lupin blanc doux, graine ","Lupine, Samen, süss weiss",null,"Leinsamen","Lin, graine "]
["Lupin bleu doux, graine ","Lupine, Samen, süss blau",null,"Lupine, Samen, süss blau","Lupin bleu doux, graine "]
["Luzerne 14 % MA, farine, déshydratée","Luzernemehl 14% RP,künstlich getrocknet",null,"Lupine, Samen, süss weiss","Lupin blanc doux, graine "]
["Luzerne 18 % MA, farine, déshydratée","Luzernemehl 18% RP,künstlich getrocknet",null,"Luzernemehl 14% RP,künstlich getrocknet","Luzerne 14 % MA, farine, déshydratée"]
["Magnésium, chlorure ","Magnesiumchlorid",null,"Luzernemehl 18% RP,künstlich getrocknet","Luzerne 18 % MA, farine, déshydratée"]
["Magnésium, oxyde ","Magnesiumoxyd",null,"Magermilch frisch","Lait écrémé frais "]
["Maïs 60 % MA, gluten ","Maiskleber 60 % RP",null,"Magermilchpulver","Lait écrémé, poudre "]
["Maïs 70 % MA, gluten ","Maiskleber 70 % RP",null,"Magnesiumchlorid","Magnésium, chlorure "]
["Maïs plante entière, déshydraté","Maispflanzen, ganz,künstlich getrocknet",null,"Magnesiumoxyd","Magnésium, oxyde "]
["Maïs, aliment de gluten (gluten feed)","Maiskleberfutter",null,"Mais, Körner","Maïs, grain "]
["Maïs, farine fourragère ","Maisfuttermehl",null,"Maisfuttermehl","Maïs, farine fourragère "]
["Maïs, germes ","Maiskeime",null,"Maiskeime","Maïs, germes "]
["Maïs, grain ","Mais, Körner",null,"Maiskleber 60 % RP","Maïs 60 % MA, gluten "]
["Maïs, rafles ","Maisspindelmehl",null,"Maiskleber 70 % RP","Maïs 70 % MA, gluten "]
["Maïs-épis, complet, séché ","Maiskolbenschrot getrocknet",null,"Maiskleberfutter","Maïs, aliment de gluten (gluten feed)"]
["Maïs-épis, ensilé, sans spathes, 30 % de rafles","Maiskolbensilage ohne Lieschblätter, 30 % Spindeln",null,"Maiskolbenschrot getrocknet","Maïs-épis, complet, séché "]
["Maïs-épis, ensilé, sans spathes, 80 % de rafles","Maiskolbensilage ohne Lieschblätter, 80 % Spindeln",null,"Maiskolbensilage ohne Lieschblätter, 30 % Spindeln","Maïs-épis, ensilé, sans spathes, 30 % de rafles"]
["Maïs-grain, ensilé ","Maiskörnersilage",null,"Maiskolbensilage ohne Lieschblätter, 80 % Spindeln","Maïs-épis, ensilé, sans spathes, 80 % de rafles"]
["Malt, germe, déshydraté","Malzkeime getrocknet",null,"Maiskörnersilage","Maïs-grain, ensilé "]
["Manioc, farine ","Tapiokamehl",null,"Maispflanzen, ganz,künstlich getrocknet","Maïs plante entière, déshydraté"]
["Marc de poires, séché ","Birnentrester getrocknet",null,"Maisspindelmehl","Maïs, rafles "]
["Marc de pommes, dépectinisé, séché","Apfeltrester getrocknet, entpektinisiert",null,"Malzkeime getrocknet","Malt, germe, déshydraté"]
["Marc de pommes, séché ","Apfeltrester getrocknet, nicht entpektinisiert",null,"Molkenkonzentrat 12 % TS","Lactosérum concentré 12 % MS"]
["Marc de raisins, séché ","Traubentrester getrocknet",null,"Molkenkonzentrat 18 % TS","Lactosérum concentré 18 % MS"]
["Mélasse de betteraves ","Zuckerrübenmelasse",null,"Molkenkonzentrat 25 % TS","Lactosérum concentré 25 % MS"]
["Millet, grain, < 4 % CB (milocorn, sorgho)","Hirse, Körner unter 4% RF(Milocorn/Sorghum)",null,"Molkenpulver(Schottepulver)","Lactosérum, poudre (petit-lait)"]
["Millet, grain, > 6 % CB ","Rispenhirse, Körner > 6 % RF",null,"Monocalciumphoshat","Phosphate monocalcique "]
["Millet, grain, 4-6 % CB ","Hirse, Körner 4-6% RF",null,"Mühlennachprodukte-gemisch (MNG)","Sous-produits de meunerie, mélange"]
["Moutarde blanche, graine, toastée","Senfsaat, weiss getoastet",null,"Na-Kaseinpulver","Poudre de caséine riche en Na"]
["Orge, farine fourragère ","Gerstenfuttermehl",null,"Na-Propionat","Propionate de sodium "]
["Orge, flocons ","Gerstenflocken",null,"Natriumchlorid (Viehsalz)","Sodium, chlorure (sel bét.) "]
["Orge, grain, léger (55-61 kg/hl)","Gerste, Körner leicht (55 - 61 kg/hl)",null,"Palmkernextraktionsschrot","Palmiste, tourteau d'extraction"]
["Orge, grain, lourd (70-74 kg/hl)","Gerste, Körner vollkörnig (70 - 74 kg/hl)",null,"Paniermehl","Panure "]
["Orge, grain, moyen (62-69 kg/hl)","Gerste, Körner mittel (62 - 69 kg/hl)",null,"Phosphat, Dikalzium-","Phosphate bicalcique "]
["Orge, issues ","Gerstenschälmehl",null,"Phosphat-dihydrat,Dikalzium","Phosphate bicalcique dihyd. "]
["Os dégélatinisés,  farine fourragère","Knochenmehl entleimt",null,"Phosphat-dihydrat,Dinatrium","Phosphate bisodique dihyd. "]
["Paille ","Strohmehl",null,"Proteinerbse, Samen","Pois protéagineux, graine "]
["Paille traitée, NaOH ","Strohmehl mit Natronlaugeaufgeschlossen",null,"Rande, Knolle, frisch","Carotte rouge "]
["Palmiste, tourteau d'extraction","Palmkernextraktionsschrot",null,"Raps-Extraktionsschrot","Colza, tourteau d'extraction"]
["Panure ","Paniermehl",null,"Rapsextraktionsschrot 00-Typ > 2.5 % RL","Tourteau d'extraction de colza 00 > 2.5 % MG"]
["Pâtes avec œufs","Teigwaren mit Eiern",null,"Rapsextraktionsschrot 00-Typ 1.3 - 2.5 % RL","Tourteau d'extraction de colza 00 1.3 -  2.5 % MG"]
["Pâtes sans œufs","Teigwaren ohne Eier",null,"Rapskuchen >9% RL","Colza, tourteau de pression, > 9 % MG"]
["Phosphate bicalcique ","Phosphat, Dikalzium-",null,"Rapskuchen 00-Typ","Tourteau de pression de colza 00"]
["Phosphate bicalcique dihyd. ","Phosphat-dihydrat,Dikalzium",null,"Rapskuchen 00-Typ kaltgepresst","Tourteau de colza 00 pressé à froid"]
["Phosphate bisodique dihyd. ","Phosphat-dihydrat,Dinatrium",null,"Rapskuchen 4-9% RL","Colza, tourteau de presse, 4-9 % MG"]
["Phosphate monocalcique ","Monocalciumphoshat",null,"Rapskuchen ausBio-Diesel","Colza, tourteau de pression, filière bio-diesel"]
["Plumes hydrolysées, farine ","Federmehl aufgeschlossen",null,"Rapssamen 00-Typ","Colza, graine "]
["Poire, fruit ","Birne frisch",null,"Reisfuttermehl, gelb","Riz, farine fourragère jaune"]
["Pois protéagineux, graine ","Proteinerbse, Samen",null,"Reisfuttermehl, weiss","Riz, farine fourragère blanche"]
["Poisson 64 % MA, farine ","Fischmehl 64 % RP",null,"Rispenhirse, Körner > 6 % RF","Millet, grain, > 6 % CB "]
["Poisson 70/72 % MA, farine ","Fischmehl 70/72 % RP Heringtyp",null,"Roggen, Körner","Seigle, grain "]
["Pomme de terre de consom- mation, crue","Kartoffel, Knolle frisch",null,"Senfsaat, weiss getoastet","Moutarde blanche, graine, toastée"]
["Pomme de terre fourragère, crue","Futterkartoffel, Knolle frisch",null,"Sojabohne, Samen","Soja, graine "]
["Pomme, fruit ","Apfel frisch",null,"Sojabohne, Samen extrudiert","Soja, graine, extrudée"]
["Pommes de terre, amidon ","Kartoffelstärke",null,"Sojabohnenschalen","Soja, coques "]
["Pommes de terre, farine ","Kartoffelmehl",null,"Sojaextraktionsschrot < 1.3 % RL, nicht entschält","Tourteau d'extraction de soja non décortiqué"]
["Pommes de terre, flocons ","Kartoffelflocken",null,"Sojaextraktionsschrot > 2.5 % RL, nicht entschält","Tourteau d'extraction de soja non décortiqué > 2.5 % % MG"]
["Pommes de terre, protéine ","Kartoffelprotein",null,"Sojaextraktionsschrot 1.3 - 2.5 % RL, nicht entschält","Tourteau d'extraction de soja non décortiqué 1.3 - 2.5 % MG"]
["Poudre de caséine riche en Ca","Ca-Kaseinpulver",null,"Sojaextraktionsschrot 48 % RP, entschält","Tourteau d'extraction de soja décortiqué 48 % MA"]
["Poudre de caséine riche en Na","Na-Kaseinpulver",null,"Soja-Extraktionsschrot,nicht entschält 44% RP","Soja, tourteau d'extraction, 44 % MA, non décortiqué"]
["Propanediol, 1,2- (Propylèneglycol)","1,2-Propandiol(Propylenglykol)",null,"Soja-Extraktionsschrot,teilentschält 48% RP","Soja, tourteau d'extraction, 48 % MA, partiel. décortiqué"]
["Propionate de calcium ","Ca-Propionat",null,"Sojakuchen, nichtentschält","Soja, tourteau de pression, non décortiqué"]
["Propionate de sodium ","Na-Propionat",null,"Sonnenblume,Samen","Tournesol, graine "]
["Protéine fourragère 70 % MA (protéine bactérienne)","Futterprotein Protorsan 70% RP",null,"Sonnenblumenextraktionsschrot, entschält","Tourteau d'extraction de tournesol décortiqué"]
["Pulpe d'agrumes, séchée ","Zitrustrester getrocknet",null,"Sonnenblumenextraktionsschrot, nicht entschält","Tourteau de pression de tournesol non décortiqué"]
["Rave ","Stoppelrübe, ohneBlätter frisch",null,"Sonnenblumenextraktionsschrot, teilentschält","Tournesol, tourteau d'extraction, partiel. décortiqué"]
["Rave sans feuilles début d'automne, fraîche, avec souillures","Stoppelrübe, ohne Blätter, Frühherbst, verschmutzt",null,"Sonnenblumenkerne > 24 % RF, nicht entschält","Graine de tournesol non décortiquée > 24 % CB"]
["Rave sans feuilles début d'automne, fraîche, propre","Stoppelrübe, ohne Blätter, Frühherbst, sauber",null,"Sonnenblumenkerne 12 - 15 % RF, teilentschält","Graine de tournesol partiellement décortiquée 12 - 15 % CB"]
["Rave sans feuilles fin d'automne, fraîche, propre","Stoppelrübe, ohne Blätter, Spätherbst, sauber",null,"Sonnenblumenkerne 15 - 24 % RF, teilentschält","Graine de tournesol partiellement décortiquée 15 - 24 % CB"]
["Riz, brisures ","Bruchreis",null,"Sonnenblumenkuchen, nicht entschält","Tournesol, tourteau d'extraction, non décortiqué"]
["Riz, farine fourragère blanche","Reisfuttermehl, weiss",null,"Sonnenblumenkuchen, teilentschält","Tournesol, tourteau de presse, partiel. décortiqué"]
["Riz, farine fourragère jaune","Reisfuttermehl, gelb",null,"Stärke, Getreide-","Amidon de céréales "]
["Sang, farine ","Blutmehl",null,"Stoppelrübe, ohne Blätter, Frühherbst, sauber","Rave sans feuilles début d'automne, fraîche, propre"]
["Seigle, grain ","Roggen, Körner",null,"Stoppelrübe, ohne Blätter, Frühherbst, verschmutzt","Rave sans feuilles début d'automne, fraîche, avec souillures"]
["Sodium, chlorure (sel bét.) ","Natriumchlorid (Viehsalz)",null,"Stoppelrübe, ohne Blätter, Spätherbst, sauber","Rave sans feuilles fin d'automne, fraîche, propre"]
["Soja, coques ","Sojabohnenschalen",null,"Stoppelrübe, ohneBlätter frisch","Rave "]
["Soja, graine ","Sojabohne, Samen",null,"Strohmehl","Paille "]
["Soja, graine, extrudée","Sojabohne, Samen extrudiert",null,"Strohmehl mit Natronlaugeaufgeschlossen","Paille traitée, NaOH "]
["Soja, tourteau de pression, non décortiqué","Sojakuchen, nichtentschält",null,"Tapiokamehl","Manioc, farine "]
["Soja, tourteau d'extraction, 44 % MA, non décortiqué","Soja-Extraktionsschrot,nicht entschält 44% RP",null,"Teigwaren mit Eiern","Pâtes avec œufs"]
["Soja, tourteau d'extraction, 48 % MA, partiel. décortiqué","Soja-Extraktionsschrot,teilentschält 48% RP",null,"Teigwaren ohne Eier","Pâtes sans œufs"]
["Sous-produits de meunerie, mélange","Mühlennachprodukte-gemisch (MNG)",null,"Traubentrester getrocknet","Marc de raisins, séché "]
["Sucre fourrager ","Futterzucker",null,"Triticale, Körner","Triticale, grain "]
["Tournesol, graine ","Sonnenblume,Samen",null,"Vollmilch, Kuh, Winter, frisch","Lait entier frais "]
["Tournesol, tourteau de presse, partiel. décortiqué","Sonnenblumenkuchen, teilentschält",null,"Vollmilchpulver, Kuh","Lait entier, poudre "]
["Tournesol, tourteau d'extraction, non décortiqué","Sonnenblumenkuchen, nicht entschält",null,"Weizen, Körner","Blé, grain "]
["Tournesol, tourteau d'extraction, partiel. décortiqué","Sonnenblumenextraktionsschrot, teilentschält",null,"Weizen, Körner expandiert","Blé grain expandé"]
["Tourteau de colza 00 pressé à froid","Rapskuchen 00-Typ kaltgepresst",null,"Weizenbollmehl","Blé, remoulage "]
["Tourteau de pression de colza 00","Rapskuchen 00-Typ",null,"Weizenfuttermehl dunkel","Blé, farine fourragère 2e (foncée)"]
["Tourteau de pression de tournesol non décortiqué","Sonnenblumenextraktionsschrot, nicht entschält",null,"Weizenfuttermehl hell","Blé, farine fourragère 1re (claire)"]
["Tourteau d'extraction de colza 00 > 2.5 % MG","Rapsextraktionsschrot 00-Typ > 2.5 % RL",null,"Weizenkeime","Blé, germe "]
["Tourteau d'extraction de colza 00 1.3 -  2.5 % MG","Rapsextraktionsschrot 00-Typ 1.3 - 2.5 % RL",null,"Weizenkleber","Blé, gluten "]
["Tourteau d'extraction de soja décortiqué 48 % MA","Sojaextraktionsschrot 48 % RP, entschält",null,"Weizenkleie","Blé, son "]
["Tourteau d'extraction de soja non décortiqué","Sojaextraktionsschrot < 1.3 % RL, nicht entschält",null,"Weizenstärke","Amidon de blé"]
["Tourteau d'extraction de soja non décortiqué > 2.5 % % MG","Sojaextraktionsschrot > 2.5 % RL, nicht entschält",null,"Wicke, Samen","Vesce, graine "]
["Tourteau d'extraction de soja non décortiqué 1.3 - 2.5 % MG","Sojaextraktionsschrot 1.3 - 2.5 % RL, nicht entschält",null,"Zichorienwurzeln frisch","Endive, racine "]
["Tourteau d'extraction de tournesol décortiqué","Sonnenblumenextraktionsschrot, entschält",null,"Zitrustrester getrocknet","Pulpe d'agrumes, séchée "]
["Triticale, grain ","Triticale, Körner",null,"Zuckerrübe frisch","Betterave sucrière, fraîche "]
["Urée ","Harnstoff",null,"Zuckerrübenmelasse","Mélasse de betteraves "]
["Vesce, graine ","Wicke, Samen",null,"Zuckerrübenschnitzel getrocknet","Betteraves, pulpe, séchée"]
["Viande 60 % MA, farine ","Fleischmehl 60% RP",null,"Zuckerrübenschnitzel siliert","Betteraves, pulpe, ensilée"]
["Viande et os 40 % MA, farine","Fleischknochenmehl 40 % RP",null,"1,2-Propandiol(Propylenglykol)","Propanediol, 1,2- (Propylèneglycol)"]